{"text_format":"1","workbook":"xlsx","n_sheets":12,"sheets":["0-INFOS GENERALES A REMPLIR","1-LIEVRE BRUN","2-OISEAUX","3-PAPILLONS","4-PLANTES","5-LEZARD AGILE","Synthese Annuelle Monitoring","listes valeurs","contrôles","test TCD","listes commentaires","compilation données pour export"],"not_rendered":{"charts":1,"images":1,"macros":1,"external_links":0,"defined_names":15,"comments":1,"pivot_tables":10},"unopened":[],"bounds":{"document_bytes":16777216,"sheet_cells":100000,"rows_first":2000,"rows_last":500,"rows_between":2000,"halvings":0,"cell_chars":16384,"cell_head_chars":4096},"cells_cut":0,"cells_raw":0,"read":"whole","date_system":"1900"}

{"sheet":"0-INFOS GENERALES A REMPLIR","index":0,"n_rows":24,"n_cols":5,"rows_kept":24,"cut":false,"hidden":false,"merged":[[21,0,21,3],[23,0,23,4],[22,0,22,4],[0,0,0,6],[1,0,1,6],[16,0,16,1],[4,4,7,4],[20,0,20,3]]}
["ANNEXE 0 - INFORMATIONS GENERALES A REMPLIR"]
[]
[]
["Année",2021,null,"date de version","2021-05-15"]
[null,null,null,"Nouveautés de l'outil","onglet 0: instructions pour la transmission des données"]
["Nom du Réseau"]
[]
["Nombre d'agriculteurs participant au réseau"]
[]
[]
["N° parcours effectués cette année*","Longueur du parcours [m]",null,"code cantonal parcours","code cantonal réseau"]
[null,null,null,{"$f":"IFERROR(INDEX('listes valeurs'!G$2:G$552,MATCH(1,('listes valeurs'!B$2:B$552='0-INFOS GENERALES A REMPLIR'!$B6)*('listes valeurs'!E$2:E$552='0-INFOS GENERALES A REMPLIR'!$A12),0)),\"\")","v":""},{"$f":"IFERROR(INDEX('listes valeurs'!A$2:A$552,MATCH(1,('listes valeurs'!B$2:B$552='0-INFOS GENERALES A REMPLIR'!$B$6)*('listes valeurs'!E$2:E$552='0-INFOS GENERALES A REMPLIR'!$A12),0)),\"\")","v":""}]
[null,null,null,{"$f":"IFERROR(INDEX('listes valeurs'!G$2:G$552,MATCH(1,('listes valeurs'!B$2:B$552='0-INFOS GENERALES A REMPLIR'!$B$6)*('listes valeurs'!E$2:E$552='0-INFOS GENERALES A REMPLIR'!$A13),0)),\"\")","v":""},{"$f":"IFERROR(INDEX('listes valeurs'!A$2:A$552,MATCH(1,('listes valeurs'!B$2:B$552='0-INFOS GENERALES A REMPLIR'!$B$6)*('listes valeurs'!E$2:E$552='0-INFOS GENERALES A REMPLIR'!$A13),0)),\"\")","v":""}]
[null,null,null,{"$f":"IFERROR(INDEX('listes valeurs'!G$2:G$552,MATCH(1,('listes valeurs'!B$2:B$552='0-INFOS GENERALES A REMPLIR'!$B$6)*('listes valeurs'!E$2:E$552='0-INFOS GENERALES A REMPLIR'!$A14),0)),\"\")","v":""},{"$f":"IFERROR(INDEX('listes valeurs'!A$2:A$552,MATCH(1,('listes valeurs'!B$2:B$552='0-INFOS GENERALES A REMPLIR'!$B$6)*('listes valeurs'!E$2:E$552='0-INFOS GENERALES A REMPLIR'!$A14),0)),\"\")","v":""}]
[null,null,null,{"$f":"IFERROR(INDEX('listes valeurs'!G$2:G$552,MATCH(1,('listes valeurs'!B$2:B$552='0-INFOS GENERALES A REMPLIR'!$B$6)*('listes valeurs'!E$2:E$552='0-INFOS GENERALES A REMPLIR'!$A15),0)),\"\")","v":""},{"$f":"IFERROR(INDEX('listes valeurs'!A$2:A$552,MATCH(1,('listes valeurs'!B$2:B$552='0-INFOS GENERALES A REMPLIR'!$B$6)*('listes valeurs'!E$2:E$552='0-INFOS GENERALES A REMPLIR'!$A15),0)),\"\")","v":""}]
[null,null,null,{"$f":"IFERROR(INDEX('listes valeurs'!G$2:G$552,MATCH(1,('listes valeurs'!B$2:B$552='0-INFOS GENERALES A REMPLIR'!$B$6)*('listes valeurs'!E$2:E$552='0-INFOS GENERALES A REMPLIR'!$A16),0)),\"\")","v":""},{"$f":"IFERROR(INDEX('listes valeurs'!A$2:A$552,MATCH(1,('listes valeurs'!B$2:B$552='0-INFOS GENERALES A REMPLIR'!$B$6)*('listes valeurs'!E$2:E$552='0-INFOS GENERALES A REMPLIR'!$A16),0)),\"\")","v":""}]
["*Si plus de 5 parcours sont effectués la même année, remplir un deuxième formulaire."]
[]
["Les données ont-elles été transmises à infospecies?"]
[]
["Instructions pour la transmission des données\nPour les utilisateurs d'ornitho.ch/Naturalist : saisir le code RAE_VD dans les remarques "]
["Pour les utilisateurs de webfauna : saisir le code RAE_VD sous Projet"]
["Pour les utilisateurs de Florapp :  s’annoncer auprès de Patrick Patthey (patrick.patthey@vd.ch)  qui transmettra vos coordonnées à Florapp et vous fournira le code à utiliser."]
["!!Attention!! Ces codes doivent être utilisés uniquement pour les observations faites dans le cadre du protocole de suivi biologique. Une observation faite en dehors du transect ou en dehors de la plage de temps dédiée au transect ne doit pas être signalée avec ces codes."]

{"sheet":"1-LIEVRE BRUN","index":1,"n_rows":28,"n_cols":4,"rows_kept":28,"cut":false,"hidden":false,"merged":[[27,1,35,6],[13,3,13,6],[0,0,0,6],[1,0,1,6],[3,1,3,4],[9,0,9,6],[13,0,13,1],[14,0,14,1],[11,3,11,6]]}
["ANNEXE 1 - FORMULAIRE DE MONITORING"]
["LIEVRE BRUN"]
[]
["Nom du réseau :",{"$f":"'0-INFOS GENERALES A REMPLIR'!B6","v":0}]
[]
["Année de suivi",{"$f":"'0-INFOS GENERALES A REMPLIR'!B4","v":2021}]
[]
["Instructions pour l'enquête \"lièvre\":"]
["Réaliser l'enquête tous les 2 ans auprès de 10 agriculteurs du réseau, en commençant par les membres du comité."]
["Leur poser la question suivante:\n« Avez-vous vu personnellement un lièvre dans le périmètre du réseau au cours de l’année écoulée, et si oui, avec quelle fréquence (estimation) ». \n"]
[]
["Nbre agriculteurs consultés",null,null,{"$f":"IF(AND(C12<>\"\",C12<10),'listes commentaires'!B2,\"\")","v":""}]
[]
["Type de réponses reçues",null,"Nbre de réponses",{"$f":"IF(C12<>SUM(C15:C19),'listes commentaires'!B4,\"\")","v":""}]
["ne sait pas"]
[null," 1 fois"]
["oui","2-5 fois"]
[null,"> 5 fois"]
["non"]
["Nombre de réponses valables*",null,{"$f":"SUM(C16:C19)","v":0}]
[]
["INDICE LIEVRE **",{"$f":"(C16+C17+C18)/(C16+C17+C18+C19)","v":{"$error":"#DIV/0!"}}]
[]
["*nombre réponses valables = nombre \"oui\" + nombre \"non\""]
[]
["** Indice lièvre = nombre \"oui\" / nombre de réponses reçues"]
[]
["Remarques"]

{"sheet":"2-OISEAUX","index":2,"n_rows":40,"n_cols":17,"rows_kept":40,"cut":false,"hidden":false,"merged":[[39,1,47,15],[31,2,31,3],[31,5,31,6],[31,8,31,9],[32,2,32,3],[32,5,32,6],[32,8,32,9],[33,2,33,3],[33,5,33,6],[33,8,33,9],[32,14,32,15],[33,14,33,15],[34,14,34,15],[36,14,36,15],[37,14,37,15],[34,2,34,3],[34,5,34,6],[34,8,34,9],[36,2,36,3],[36,5,36,6],[36,8,36,9],[37,2,37,3],[37,5,37,6],[37,8,37,9],[25,0,25,1],[25,2,25,3],[25,5,25,6],[25,8,25,9],[26,2,26,3],[26,5,26,6],[26,8,26,9],[27,2,27,3],[27,5,27,6],[27,8,27,9],[19,2,19,3],[19,5,19,6],[19,8,19,9],[20,2,20,3],[20,5,20,6],[20,8,20,9],[21,2,21,3],[21,5,21,6],[21,8,21,9],[16,2,16,3],[16,5,16,6],[16,8,16,9],[17,2,17,3],[17,5,17,6],[17,8,17,9],[18,2,18,3],[18,5,18,6],[18,8,18,9],[12,2,12,3],[12,5,12,6],[12,8,12,9],[14,2,14,3],[14,5,14,6],[14,8,14,9],[15,2,15,3],[15,5,15,6],[15,8,15,9],[7,11,7,12],[8,11,8,12],[10,11,10,12],[12,11,12,12],[0,0,0,3],[1,0,1,3],[2,0,2,1],[3,2,3,3],[5,2,5,3],[5,5,5,6],[5,8,5,9],[7,0,7,1],[7,2,7,3],[7,5,7,6],[7,8,7,9],[8,0,8,1],[8,2,8,3],[8,5,8,6],[8,8,8,9],[9,0,9,1],[10,0,10,1],[10,2,10,3],[10,5,10,6],[10,8,10,9],[31,11,31,12],[19,11,19,12],[20,11,20,12],[21,11,21,12],[25,11,25,12],[26,11,26,12],[14,11,14,12],[15,11,15,12],[16,11,16,12],[17,11,17,12],[18,11,18,12],[31,14,31,15],[37,11,37,12],[24,2,24,3],[24,5,24,6],[24,8,24,9],[24,11,24,12],[24,14,24,15],[28,2,28,3],[28,5,28,6],[28,8,28,9],[29,2,29,3],[29,5,29,6],[29,8,29,9],[30,2,30,3],[30,5,30,6],[30,8,30,9],[25,14,25,15],[26,14,26,15],[32,11,32,12],[33,11,33,12],[34,11,34,12],[36,11,36,12],[27,11,27,12],[28,11,28,12],[23,2,23,3],[23,5,23,6],[23,8,23,9],[23,11,23,12],[23,14,23,15],[27,14,27,15],[28,14,28,15],[29,14,29,15],[30,14,30,15],[29,11,29,12],[30,11,30,12],[5,4,8,4],[5,7,8,7],[5,10,8,10],[5,13,8,13],[5,16,8,16],[22,2,22,3],[22,5,22,6],[22,8,22,9],[22,11,22,12],[22,14,22,15],[19,14,19,15],[20,14,20,15],[21,14,21,15],[14,14,14,15],[15,14,15,15],[16,14,16,15],[17,14,17,15],[18,14,18,15],[5,14,5,15],[7,14,7,15],[8,14,8,15],[10,14,10,15],[12,14,12,15],[5,11,5,12]]}
["ANNEXE 2 - FORMULAIRE DE MONITORING"]
["OISEAUX"]
[]
[null,"Nom du réseau :",{"$f":"'0-INFOS GENERALES A REMPLIR'!B6","v":0}]
[]
[null,"No du parcours : ",{"$f":"'0-INFOS GENERALES A REMPLIR'!A12","v":0},null,{"$f":"IF(C9<>\"\",IF(OR(C9<DATE('0-INFOS GENERALES A REMPLIR'!B4,'listes valeurs'!K2,'listes valeurs'!J2),C9>DATE('0-INFOS GENERALES A REMPLIR'!B4,'listes valeurs'!K3,'listes valeurs'!J3)),'listes commentaires'!B6,\"\"),\"\")","v":""},{"$f":"'0-INFOS GENERALES A REMPLIR'!A13","v":0},null,{"$f":"IF(F9<>\"\",IF(OR(F9<DATE('0-INFOS GENERALES A REMPLIR'!B4,'listes valeurs'!K2,'listes valeurs'!J2),F9>DATE('0-INFOS GENERALES A REMPLIR'!B4,'listes valeurs'!K3,'listes valeurs'!J3)),'listes commentaires'!B6,\"\"),\"\")","v":""},{"$f":"'0-INFOS GENERALES A REMPLIR'!A14","v":0},null,{"$f":"IF(I9<>\"\",IF(OR(I9<DATE('0-INFOS GENERALES A REMPLIR'!B4,'listes valeurs'!K2,'listes valeurs'!J2),I9>DATE('0-INFOS GENERALES A REMPLIR'!B4,'listes valeurs'!K3,'listes valeurs'!J3)),'listes commentaires'!B6,\"\"),\"\")","v":""},{"$f":"'0-INFOS GENERALES A REMPLIR'!A15","v":0},null,{"$f":"IF(L9<>\"\",IF(OR(L9<DATE('0-INFOS GENERALES A REMPLIR'!B4,'listes valeurs'!K2,'listes valeurs'!J2),L9>DATE('0-INFOS GENERALES A REMPLIR'!B4,'listes valeurs'!K3,'listes valeurs'!J3)),'listes commentaires'!B6,\"\"),\"\")","v":""},{"$f":"'0-INFOS GENERALES A REMPLIR'!A16","v":0},null,{"$f":"IF(O9<>\"\",IF(OR(O9<DATE('0-INFOS GENERALES A REMPLIR'!B4,'listes valeurs'!K2,'listes valeurs'!J2),O9>DATE('0-INFOS GENERALES A REMPLIR'!B4,'listes valeurs'!K3,'listes valeurs'!J3)),'listes commentaires'!B6,\"\"),\"\")","v":""}]
[]
["Conditions météo durant le parcours :"]
["Date de passage (exemple: 21.05.2017):"]
["Heure de début et de fin du parcours\n (format: 5:45) :",null,null,null,{"$f":"IF(AND(C10<>\"\",D10<>\"\"),IF(OR(C10<'listes valeurs'!$O$2,D10>'listes valeurs'!$O$3),'listes commentaires'!$B$7,\"\"),\"\")","v":""},null,null,{"$f":"IF(AND(F10<>\"\",G10<>\"\"),IF(OR(F10<'listes valeurs'!$O$2,G10>'listes valeurs'!$O$3),'listes commentaires'!$B$7,\"\"),\"\")","v":""},null,null,{"$f":"IF(AND(I10<>\"\",J10<>\"\"),IF(OR(I10<'listes valeurs'!$O$2,J10>'listes valeurs'!$O$3),'listes commentaires'!$B$7,\"\"),\"\")","v":""},null,null,{"$f":"IF(AND(L10<>\"\",M10<>\"\"),IF(OR(L10<'listes valeurs'!$O$2,M10>'listes valeurs'!$O$3),'listes commentaires'!$B$7,\"\"),\"\")","v":""},null,null,{"$f":"IF(AND(O10<>\"\",P10<>\"\"),IF(OR(O10<'listes valeurs'!$O$2,P10>'listes valeurs'!$O$3),'listes commentaires'!$B$7,\"\"),\"\")","v":""}]
["Durée totale du parcours sans les pauses (min.):",null,{"$f":"(D10-C10)*1440","v":0},null,null,{"$f":"(G10-F10)*1440","v":0},null,null,{"$f":"(J10-I10)*1440","v":0},null,null,{"$f":"(M10-L10)*1440","v":0},null,null,{"$f":"(P10-O10)*1440","v":0}]
[]
["Nom de l’observateur : "]
[]
["Abréviation","Nom","Nombre de territoires",null,null,"Nombre de territoires",null,null,"Nombre de territoires",null,null,"Nombre de territoires",null,null,"Nombre de territoires"]
["ALC","Alouette des champs"]
["BRJ","Bruant jaune"]
["BRP","Bruant proyer"]
["PGE","Pie-grièche écorcheur"]
["TOR","Torcol"]
["TDP","Tarier des prés"]
["TPA","Tarier pâtre"]
[]
[]
[]
[]
[{"$f":"IFERROR(INDEX('listes valeurs'!T$2:T$403,MATCH(1,('listes valeurs'!U$2:U$403='2-OISEAUX'!$B27)*('listes valeurs'!U$2:U$403='2-OISEAUX'!$B27),0)),\"\")","v":0}]
[{"$f":"IFERROR(INDEX('listes valeurs'!T$2:T$403,MATCH(1,('listes valeurs'!U$2:U$403='2-OISEAUX'!$B28)*('listes valeurs'!U$2:U$403='2-OISEAUX'!$B28),0)),\"\")","v":0}]
[{"$f":"IFERROR(INDEX('listes valeurs'!T$2:T$403,MATCH(1,('listes valeurs'!U$2:U$403='2-OISEAUX'!$B29)*('listes valeurs'!U$2:U$403='2-OISEAUX'!$B29),0)),\"\")","v":0}]
[{"$f":"IFERROR(INDEX('listes valeurs'!T$2:T$403,MATCH(1,('listes valeurs'!U$2:U$403='2-OISEAUX'!$B30)*('listes valeurs'!U$2:U$403='2-OISEAUX'!$B30),0)),\"\")","v":0}]
[{"$f":"IFERROR(INDEX('listes valeurs'!T$2:T$403,MATCH(1,('listes valeurs'!U$2:U$403='2-OISEAUX'!$B31)*('listes valeurs'!U$2:U$403='2-OISEAUX'!$B31),0)),\"\")","v":0}]
[{"$f":"IFERROR(INDEX('listes valeurs'!T$2:T$403,MATCH(1,('listes valeurs'!U$2:U$403='2-OISEAUX'!$B32)*('listes valeurs'!U$2:U$403='2-OISEAUX'!$B32),0)),\"\")","v":0}]
[{"$f":"IFERROR(INDEX('listes valeurs'!T$2:T$403,MATCH(1,('listes valeurs'!U$2:U$403='2-OISEAUX'!$B33)*('listes valeurs'!U$2:U$403='2-OISEAUX'!$B33),0)),\"\")","v":0}]
[{"$f":"IFERROR(INDEX('listes valeurs'!T$2:T$403,MATCH(1,('listes valeurs'!U$2:U$403='2-OISEAUX'!$B34)*('listes valeurs'!U$2:U$403='2-OISEAUX'!$B34),0)),\"\")","v":0}]
[{"$f":"IFERROR(INDEX('listes valeurs'!T$2:T$403,MATCH(1,('listes valeurs'!U$2:U$403='2-OISEAUX'!$B35)*('listes valeurs'!U$2:U$403='2-OISEAUX'!$B35),0)),\"\")","v":0}]
[]
[null,null,"Nombre de contacts",null,null,"Nombre de contacts",null,null,"Nombre de contacts",null,null,"Nombre de contacts",null,null,"Nombre de contacts"]
["LEA","Lézard agile",null,null,null,null,null,null,null,null,null,null,null,null,null,null,{"$f":"SUM(C38:P38)","v":0}]
[]
["Remarques"]

{"sheet":"3-PAPILLONS","index":3,"n_rows":182,"n_cols":10,"rows_kept":182,"cut":false,"hidden":false,"merged":[[181,1,189,8],[94,0,94,1],[106,2,106,3],[106,5,106,6],[106,7,106,8],[107,2,107,3],[107,5,107,6],[107,7,107,8],[110,0,110,1],[111,2,111,6],[113,2,113,6],[117,2,117,3],[117,5,117,6],[115,2,115,6],[118,2,118,3],[118,5,118,6],[82,2,82,3],[82,5,82,6],[83,2,83,3],[83,5,83,6],[86,2,86,3],[86,5,86,6],[74,0,74,1],[75,2,75,6],[77,2,77,6],[81,2,81,3],[81,5,81,6],[79,2,79,6],[58,0,58,1],[70,2,70,3],[70,5,70,6],[70,7,70,8],[71,2,71,3],[71,5,71,6],[71,7,71,8],[46,2,46,3],[46,5,46,6],[47,2,47,3],[47,5,47,6],[50,2,50,3],[50,5,50,6],[38,0,38,1],[39,2,39,6],[41,2,41,6],[43,2,43,6],[45,2,45,3],[45,5,45,6],[22,0,22,1],[34,2,34,3],[34,5,34,6],[34,7,34,8],[35,2,35,3],[35,5,35,6],[35,7,35,8],[130,0,130,1],[0,0,0,8],[1,0,1,8],[2,0,2,1],[3,2,3,6],[5,2,5,6],[7,2,7,6],[9,2,9,3],[9,5,9,6],[10,2,10,3],[10,5,10,6],[9,4,11,4],[11,2,11,3],[11,5,11,6],[14,2,14,3],[14,5,14,6],[143,7,143,8],[119,2,119,3],[119,5,119,6],[122,2,122,3],[122,5,122,6],[166,0,166,1],[147,2,147,6],[149,2,149,6],[153,2,153,3],[153,5,153,6],[154,2,154,3],[154,5,154,6],[151,2,151,6],[9,7,11,7],[178,2,178,3],[178,5,178,6],[178,7,178,8],[179,2,179,3],[179,5,179,6],[179,7,179,8],[155,2,155,3],[155,5,155,6],[158,2,158,3],[158,5,158,6],[142,2,142,3],[142,5,142,6],[142,7,142,8],[143,2,143,3],[143,5,143,6]]}
["ANNEXE 3 - FORMULAIRE DE MONITORING"]
["PAPILLONS"]
[]
[null,"Nom du réseau :",{"$f":"'0-INFOS GENERALES A REMPLIR'!B6","v":0}]
[]
[null,"No du parcours : ",{"$f":"'0-INFOS GENERALES A REMPLIR'!A12","v":0}]
[]
[null,"Nom de l’observateur : "]
[]
[null,null,"Passage 1",null,{"$f":"IF(C12<>\"\",IF(OR(C12<DATE('0-INFOS GENERALES A REMPLIR'!B$4,'listes valeurs'!K$2,'listes valeurs'!J$2),C12>DATE('0-INFOS GENERALES A REMPLIR'!B$4,'listes valeurs'!K$3,'listes valeurs'!J$3)),'listes commentaires'!B$6,\"\"),\"\")","v":""},"Passage 2",null,{"$f":"IF(F12<>\"\",IF(OR(F12<DATE('0-INFOS GENERALES A REMPLIR'!B$4,'listes valeurs'!N$2,'listes valeurs'!M$2),F12>DATE('0-INFOS GENERALES A REMPLIR'!B$4,'listes valeurs'!N$3,'listes valeurs'!M$3)),'listes commentaires'!B$9,\"\"),\"\")","v":""}]
[null,"Conditions météo durant le parcours (voir légende):"]
[null,"Date de passage  (exemple: 21.05.2017):"]
[]
[null,"Heure de début et de fin du parcours (exemple 10:25) : ",null,null,{"$f":"IF(AND(C14<>\"\",D14<>\"\"),IF(OR(C14<'listes valeurs'!P$2,D$14>'listes valeurs'!P$3),'listes commentaires'!B$10,\"\"),\"\")","v":""},null,null,{"$f":"IF(AND(F14<>\"\",G14<>\"\"),IF(OR(F14<'listes valeurs'!P$2,G$14>'listes valeurs'!P$3),'listes commentaires'!B$10,\"\"),\"\")","v":""}]
[null,"Durée totale du parcours sans les pauses (min.):",{"$f":"(D14-C14)*1440","v":0},null,null,{"$f":"(G14-F14)*1440","v":0}]
[]
["Code","Nom commun","IN","OUT",null,"IN","OUT","TOTAL IN","TOTAL OUT"]
["DEM","Demi-deuil",null,null,null,null,null,{"$f":"C18+F18","v":0},{"$f":"D18+G18","v":0}]
["MYR","Myrtil",null,null,null,null,null,{"$f":"C19+F19","v":0},{"$f":"D19+G19","v":0}]
["SIL","Silène",null,null,null,null,null,{"$f":"C20+F20","v":0},0]
["TRI","Tristan",null,null,null,null,null,{"$f":"C21+F21","v":0},0]
["NAC","Nacré de la sanguisorbe",null,null,null,null,null,{"$f":"C22+F22","v":0},0]
["Autres espèces"]
[null,null,null,null,null,null,null,{"$f":"C24+F24","v":0},0]
[null,null,null,null,null,null,null,0,0]
[null,null,null,null,null,null,null,0,0]
[null,null,null,null,null,null,null,0,0]
[null,null,null,null,null,null,null,0,0]
[null,null,null,null,null,null,null,0,0]
[null,null,null,null,null,null,null,0,0]
[null,null,null,null,null,null,null,0,0]
[null,null,null,null,null,null,null,0,0]
[null,null,null,null,null,null,null,0,0]
[]
[null,null,"Nombre de contacts",null,null,"Nombre de contacts",null,"Nombre total de contacts"]
["Lacerta agilis","Lézard agile",null,null,null,null,null,{"$f":"F36+C36","v":0}]
[]
[]
[]
[null,"Nom du réseau :",{"$f":"'0-INFOS GENERALES A REMPLIR'!B6","v":0}]
[]
[null,"No du parcours : ",{"$f":"'0-INFOS GENERALES A REMPLIR'!A13","v":0}]
[]
[null,"Nom de l’observateur : "]
[]
[null,null,"Passage 1",null,null,"Passage 2"]
[null,"Conditions météo durant le parcours (voir légende):"]
[null,"Date de passage  (exemple: 21.05.2017):",null,null,{"$f":"IF(C48<>\"\",IF(OR(C48<DATE('0-INFOS GENERALES A REMPLIR'!B$4,'listes valeurs'!K$2,'listes valeurs'!J$2),C48>DATE('0-INFOS GENERALES A REMPLIR'!B$4,'listes valeurs'!K$3,'listes valeurs'!J$3)),'listes commentaires'!B$6,\"\"),\"\")","v":""},null,null,{"$f":"IF(F48<>\"\",IF(OR(F48<DATE('0-INFOS GENERALES A REMPLIR'!B$4,'listes valeurs'!N$2,'listes valeurs'!M$2),F48>DATE('0-INFOS GENERALES A REMPLIR'!B$4,'listes valeurs'!N$3,'listes valeurs'!M$3)),'listes commentaires'!B$9,\"\"),\"\")","v":""}]
[]
[null,"Heure de début et de fin du parcours :",null,null,{"$f":"IF(AND(C50<>\"\",D50<>\"\"),IF(OR(C50<'listes valeurs'!P$2,D$50>'listes valeurs'!P$3),'listes commentaires'!B$10,\"\"),\"\")","v":""},null,null,{"$f":"IF(AND(F50<>\"\",G50<>\"\"),IF(OR(F50<'listes valeurs'!P$2,G50>'listes valeurs'!P$3),'listes commentaires'!B$10,\"\"),\"\")","v":""}]
[null,"Durée totale du parcours sans les pauses (min.):",{"$f":"(D50-C50)*1440","v":0},null,null,{"$f":"(G50-F50)*1440","v":0}]
[]
["Code","Nom commun","IN","OUT",null,"IN","OUT","TOTAL IN","TOTAL OUT"]
[{"$f":"A18","v":"DEM"},{"$f":"B18","v":"Demi-deuil"},null,null,null,null,null,{"$f":"C54+F54","v":0},{"$f":"D54+G54","v":0}]
[{"$f":"A19","v":"MYR"},"Myrtil",null,null,null,null,null,{"$f":"C55+F55","v":0},{"$f":"D55+G55","v":0}]
[{"$f":"A20","v":"SIL"},"Silène",null,null,null,null,null,{"$f":"C56+F56","v":0},0]
[{"$f":"A21","v":"TRI"},"Tristan",null,null,null,null,null,{"$f":"C57+F57","v":0},0]
[{"$f":"A22","v":"NAC"},"Nacré de la sanguisorbe",null,null,null,null,null,{"$f":"C58+F58","v":0},0]
["Autres espèces"]
[null,null,null,null,null,null,null,{"$f":"C60+F60","v":0},0]
[null,null,null,null,null,null,null,{"$f":"C61+F61","v":0},{"$f":"D61+G61","v":0}]
[null,null,null,null,null,null,null,0,0]
[null,null,null,null,null,null,null,0,0]
[null,null,null,null,null,null,null,0,0]
[null,null,null,null,null,null,null,0,0]
[null,null,null,null,null,null,null,0,0]
[null,null,null,null,null,null,null,0,0]
[null,null,null,null,null,null,null,0,0]
[null,null,null,null,null,null,null,0,0]
[]
[null,null,"Nombre de contacts",null,null,"Nombre de contacts",null,"Nombre total de contacts"]
["Lacerta agilis","Lézard agile",null,null,null,null,null,{"$f":"F72+C72","v":0}]
[]
[]
[]
[null,"Nom du réseau :",{"$f":"'0-INFOS GENERALES A REMPLIR'!B6","v":0}]
[]
[null,"No du parcours : ",{"$f":"'0-INFOS GENERALES A REMPLIR'!A14","v":0}]
[]
[null,"Nom de l’observateur : "]
[]
[null,null,"Passage 1",null,null,"Passage 2"]
[null,"Conditions météo durant le parcours (voir légende):"]
[null,"Date de passage  (exemple: 21.05.2017):",null,null,{"$f":"IF(C84<>\"\",IF(OR(C84<DATE('0-INFOS GENERALES A REMPLIR'!B$4,'listes valeurs'!K$2,'listes valeurs'!J$2),C84>DATE('0-INFOS GENERALES A REMPLIR'!B$4,'listes valeurs'!K$3,'listes valeurs'!J$3)),'listes commentaires'!B$6,\"\"),\"\")","v":""},null,null,{"$f":"IF(F84<>\"\",IF(OR(F84<DATE('0-INFOS GENERALES A REMPLIR'!B$4,'listes valeurs'!N$2,'listes valeurs'!M$2),F84>DATE('0-INFOS GENERALES A REMPLIR'!B$4,'listes valeurs'!N$3,'listes valeurs'!M$3)),'listes commentaires'!B$9,\"\"),\"\")","v":""}]
[]
[null,"Heure de début et de fin du parcours :",null,null,{"$f":"IF(AND(C86<>\"\",D86<>\"\"),IF(OR(C86<'listes valeurs'!P$2,D86>'listes valeurs'!P$3),'listes commentaires'!B$10,\"\"),\"\")","v":""},null,null,{"$f":"IF(AND(F86<>\"\",G86<>\"\"),IF(OR(F86<'listes valeurs'!P$2,G86>'listes valeurs'!P$3),'listes commentaires'!B$10,\"\"),\"\")","v":""}]
[null,"Durée totale du parcours sans les pauses (min.):",{"$f":"(D86-C86)*1440","v":0},null,null,{"$f":"(G86-F86)*1440","v":0}]
[]
["Code","Nom commun","IN","OUT",null,"IN","OUT","TOTAL IN","TOTAL OUT"]
[{"$f":"A54","v":"DEM"},{"$f":"B54","v":"Demi-deuil"},null,null,null,null,null,{"$f":"C90+F90","v":0},{"$f":"D90+G90","v":0}]
[{"$f":"A55","v":"MYR"},"Myrtil",null,null,null,null,null,{"$f":"C91+F91","v":0},{"$f":"D91+G91","v":0}]
[{"$f":"A56","v":"SIL"},"Silène",null,null,null,null,null,{"$f":"C92+F92","v":0},0]
[{"$f":"A57","v":"TRI"},"Tristan",null,null,null,null,null,{"$f":"C93+F93","v":0},0]
[{"$f":"A58","v":"NAC"},"Nacré de la sanguisorbe",null,null,null,null,null,{"$f":"C94+F94","v":0},0]
["Autres espèces"]
[null,null,null,null,null,null,null,{"$f":"C96+F96","v":0},0]
[null,null,null,null,null,null,null,{"$f":"C97+F97","v":0},{"$f":"D97+G97","v":0}]
[null,null,null,null,null,null,null,0,0]
[null,null,null,null,null,null,null,0,0]
[null,null,null,null,null,null,null,0,0]
[null,null,null,null,null,null,null,0,0]
[null,null,null,null,null,null,null,0,0]
[null,null,null,null,null,null,null,0,0]
[null,null,null,null,null,null,null,0,0]
[null,null,null,null,null,null,null,0,0]
[]
[null,null,"Nombre de contacts",null,null,"Nombre de contacts",null,"Nombre total de contacts"]
["Lacerta agilis","Lézard agile",null,null,null,null,null,{"$f":"F108+C108","v":0}]
[]
[]
[]
[null,"Nom du réseau :",{"$f":"'0-INFOS GENERALES A REMPLIR'!B6","v":0}]
[]
[null,"No du parcours : ",{"$f":"'0-INFOS GENERALES A REMPLIR'!A15","v":0}]
[]
[null,"Nom de l’observateur : "]
[]
[null,null,"Passage 1",null,null,"Passage 2"]
[null,"Conditions météo durant le parcours (voir légende):"]
[null,"Date de passage  (exemple: 21.05.2017):",null,null,{"$f":"IF(C120<>\"\",IF(OR(C120<DATE('0-INFOS GENERALES A REMPLIR'!B$4,'listes valeurs'!K$2,'listes valeurs'!J$2),C120>DATE('0-INFOS GENERALES A REMPLIR'!B$4,'listes valeurs'!K$3,'listes valeurs'!J$3)),'listes commentaires'!B$6,\"\"),\"\")","v":""},null,null,{"$f":"IF(F120<>\"\",IF(OR(F120<DATE('0-INFOS GENERALES A REMPLIR'!B$4,'listes valeurs'!N$2,'listes valeurs'!M$2),F120>DATE('0-INFOS GENERALES A REMPLIR'!B$4,'listes valeurs'!N$3,'listes valeurs'!M$3)),'listes commentaires'!B$9,\"\"),\"\")","v":""}]
[]
[null,"Heure de début et de fin du parcours :",null,null,{"$f":"IF(AND(C122<>\"\",D122<>\"\"),IF(OR(C122<'listes valeurs'!P$2,D122>'listes valeurs'!P$3),'listes commentaires'!B$10,\"\"),\"\")","v":""},null,null,{"$f":"IF(AND(F122<>\"\",G122<>\"\"),IF(OR(F122<'listes valeurs'!P$2,G122>'listes valeurs'!P$3),'listes commentaires'!B$10,\"\"),\"\")","v":""}]
[null,"Durée totale du parcours sans les pauses (min.):",{"$f":"(D122-C122)*1440","v":0},null,null,{"$f":"(G122-F122)*1440","v":0}]
[]
["Code","Nom commun","IN","OUT",null,"IN","OUT","TOTAL IN","TOTAL OUT"]
[{"$f":"A90","v":"DEM"},{"$f":"B90","v":"Demi-deuil"},null,null,null,null,null,{"$f":"C126+F126","v":0},{"$f":"D126+G126","v":0}]
[{"$f":"A91","v":"MYR"},"Myrtil",null,null,null,null,null,{"$f":"C127+F127","v":0},{"$f":"D127+G127","v":0}]
[{"$f":"A92","v":"SIL"},"Silène",null,null,null,null,null,{"$f":"C128+F128","v":0},0]
[{"$f":"A93","v":"TRI"},"Tristan",null,null,null,null,null,{"$f":"C129+F129","v":0},0]
[{"$f":"A94","v":"NAC"},"Nacré de la sanguisorbe",null,null,null,null,null,{"$f":"C130+F130","v":0},0]
["Autres espèces"]
[null,null,null,null,null,null,null,{"$f":"C132+F132","v":0},{"$f":"D132+G132","v":0}]
[null,null,null,null,null,null,null,{"$f":"C133+F133","v":0},{"$f":"D133+G133","v":0}]
[null,null,null,null,null,null,null,0,0]
[null,null,null,null,null,null,null,0,0]
[null,null,null,null,null,null,null,0,0]
[null,null,null,null,null,null,null,0,0]
[null,null,null,null,null,null,null,0,0]
[null,null,null,null,null,null,null,0,0]
[null,null,null,null,null,null,null,0,0]
[null,null,null,null,null,null,null,0,0]
[]
[null,null,"Nombre de contacts",null,null,"Nombre de contacts",null,"Nombre total de contacts"]
["Lacerta agilis","Lézard agile",null,null,null,null,null,{"$f":"F144+C144","v":0}]
[]
[]
[]
[null,"Nom du réseau :",{"$f":"'0-INFOS GENERALES A REMPLIR'!B6","v":0}]
[]
[null,"No du parcours : ",{"$f":"'0-INFOS GENERALES A REMPLIR'!A16","v":0}]
[]
[null,"Nom de l’observateur : "]
[]
[null,null,"Passage 1",null,null,"Passage 2"]
[null,"Conditions météo durant le parcours (voir légende):"]
[null,"Date de passage  (exemple: 21.05.2017):",null,null,{"$f":"IF(C156<>\"\",IF(OR(C156<DATE('0-INFOS GENERALES A REMPLIR'!B$4,'listes valeurs'!K$2,'listes valeurs'!J$2),C156>DATE('0-INFOS GENERALES A REMPLIR'!B$4,'listes valeurs'!K$3,'listes valeurs'!J$3)),'listes commentaires'!B$6,\"\"),\"\")","v":""},null,null,{"$f":"IF(F156<>\"\",IF(OR(F156<DATE('0-INFOS GENERALES A REMPLIR'!B$4,'listes valeurs'!N$2,'listes valeurs'!M$2),F156>DATE('0-INFOS GENERALES A REMPLIR'!B$4,'listes valeurs'!N$3,'listes valeurs'!M$3)),'listes commentaires'!B$9,\"\"),\"\")","v":""}]
[]
[null,"Heure de début et de fin du parcours :",null,null,{"$f":"IF(AND(C158<>\"\",D158<>\"\"),IF(OR(C158<'listes valeurs'!P$2,D158>'listes valeurs'!P$3),'listes commentaires'!B$10,\"\"),\"\")","v":""},null,null,{"$f":"IF(AND(F158<>\"\",G158<>\"\"),IF(OR(F158<'listes valeurs'!P$2,G158>'listes valeurs'!P$3),'listes commentaires'!B$10,\"\"),\"\")","v":""}]
[null,"Durée totale du parcours sans les pauses (min.):",{"$f":"(D158-C158)*1440","v":0},null,null,{"$f":"(G158-F158)*1440","v":0}]
[]
["Code","Nom commun","IN","OUT",null,"IN","OUT","TOTAL IN","TOTAL OUT"]
[{"$f":"A126","v":"DEM"},{"$f":"B126","v":"Demi-deuil"},null,null,null,null,null,{"$f":"C162+F162","v":0},{"$f":"D162+G162","v":0}]
[{"$f":"A127","v":"MYR"},"Myrtil",null,null,null,null,null,{"$f":"C163+F163","v":0},{"$f":"D163+G163","v":0}]
[{"$f":"A128","v":"SIL"},"Silène",null,null,null,null,null,{"$f":"C164+F164","v":0},0]
[{"$f":"A129","v":"TRI"},"Tristan",null,null,null,null,null,{"$f":"C165+F165","v":0},0]
[{"$f":"A130","v":"NAC"},"Nacré de la sanguisorbe",null,null,null,null,null,{"$f":"C166+F166","v":0},0]
["Autres espèces"]
[null,null,null,null,null,null,null,{"$f":"C168+F168","v":0},0]
[null,null,null,null,null,null,null,{"$f":"C169+F169","v":0},{"$f":"D169+G169","v":0}]
[null,null,null,null,null,null,null,0,0]
[null,null,null,null,null,null,null,0,0]
[null,null,null,null,null,null,null,0,0]
[null,null,null,null,null,null,null,0,0]
[null,null,null,null,null,null,null,0,0]
[null,null,null,null,null,null,null,0,0]
[null,null,null,null,null,null,null,0,0]
[null,null,null,null,null,null,null,0,0]
[]
[null,null,"Nombre de contacts",null,null,"Nombre de contacts",null,"Nombre total de contacts"]
["Lacerta agilis","Lézard agile",null,null,null,null,null,{"$f":"SUM(C180:G180)","v":0},null,{"$f":"SUM(H180+H144+H108+H72+H36)","v":0}]
[]
["Remarques"]

{"sheet":"4-PLANTES","index":4,"n_rows":43,"n_cols":7,"rows_kept":43,"cut":false,"hidden":false,"merged":[[40,0,40,11],[42,0,42,11],[14,0,14,11],[37,2,37,3],[38,2,38,3],[15,6,15,10],[15,1,15,2],[7,4,7,9],[9,4,9,9],[11,4,11,5],[11,6,11,9],[13,0,13,11],[0,0,0,11],[1,0,1,11],[3,4,3,9],[5,0,5,2],[5,4,5,9]]}
["ANNEXE 4 - FORMULAIRE DE MONITORING"]
["PLANTES"]
[]
["Nom du réseau :",null,null,null,{"$f":"'0-INFOS GENERALES A REMPLIR'!B6","v":0}]
[]
["Nombre de parcelles SPB favorables inscrites au réseau*: ",null,null,null,0]
[]
["Nombre de parcelles SPB visitées: ",null,null,null,0]
[]
["Nom de l’observateur : "]
[]
["Date :",null,null,null,null,null,{"$f":"IF(E12<>\"\",IF(OR(E12<DATE('0-INFOS GENERALES A REMPLIR'!B4,'listes valeurs'!S2,'listes valeurs'!R2),E12>DATE('0-INFOS GENERALES A REMPLIR'!B4,'listes valeurs'!S3,'listes valeurs'!R3)),'listes commentaires'!B12,\"\"),\"\")","v":""}]
[]
["Noter la présence / l'absence des espèces  (présence=1/absence=0) dans le tableau ci-dessous."]
[]
[null,"Suivi cantonal",null,null,null,null,"Autres plantes indicatrices ou caractéristiques du réseau"]
["Parcelle no","Silene","Kickxia"]
[]
[]
[]
[]
[]
[]
[]
[]
[]
[]
[]
[]
[]
[]
[]
["Nb parcelles",{"$f":"COUNTA(B18:B32)","v":0},{"$f":"COUNTA(C18:C32)","v":0}]
["% présence dans SPB * ",{"$f":"COUNTIF(B18:B32,1)/COUNTIF(B18:B32,\">-1\")","v":{"$error":"#DIV/0!"}},{"$f":"COUNTIF(C18:C32,1)/COUNTIF(C18:C32,\">-1\")","v":{"$error":"#DIV/0!"}}]
["Présence hors SPB (oui/non)"]
[]
[]
[null,null,"Nombre de contacts"]
["Lézard agile","Lacerta agilis"]
[]
["* Jachères florales, jachères tournantes, bandes culturales extensives ou ourlet sur terres assolées inscrits au réseau"]
[]
["** Proportion des parcelles visitées avec présence de l’espèce = nombre de parcelles SPB avec présence de l'espèce/nombre de parcelles SPB visitées"]

{"sheet":"5-LEZARD AGILE","index":5,"n_rows":21,"n_cols":5,"rows_kept":21,"cut":false,"hidden":false,"merged":[[0,0,0,4],[1,0,1,4],[3,2,3,4],[7,2,7,4]]}
["ANNEXE 5 - FORMULAIRE DE MONITORING"]
["LEZARD AGILE"]
[]
["Nom du réseau :",null,{"$f":"'0-INFOS GENERALES A REMPLIR'!B6","v":0}]
[]
["Année de suivi",null,{"$f":"'0-INFOS GENERALES A REMPLIR'!B4","v":2021}]
[]
["Nom de l’observateur : "]
[]
["Nom latin","Nom commun","Nbre cumulé de contacts*","Nbre de sites différents **","Mètres totaux"]
["Lacerta agilis","Lézard agile",{"$f":"'2-OISEAUX'!Q38+'3-PAPILLONS'!J180+'4-PLANTES'!C39:D39","v":0},null,{"$f":"SUM('0-INFOS GENERALES A REMPLIR'!B12:B16)","v":0}]
[]
[]
["Nom latin","Nom commun","Autres contacts dans le périmètre du réseau (oui/non)"]
["Lacerta agilis","Lézard agile"]
[]
[]
[]
[]
["* Nbre cumulé total de contacts durant les suivis oiseaux, papillons et plantes"]
["** Sites = points d'observation distants de plus de 100 m"]

{"sheet":"Synthese Annuelle Monitoring","index":6,"n_rows":43,"n_cols":17,"rows_kept":43,"cut":false,"hidden":true,"merged":[[21,11,21,12],[22,11,22,12],[23,11,23,12],[24,11,24,12],[25,11,25,12],[16,11,16,12],[17,11,17,12],[18,11,18,12],[19,11,19,12],[20,11,20,12],[21,9,21,10],[23,7,23,8],[23,5,23,6],[24,5,24,6],[25,5,25,6],[24,7,24,8],[25,7,25,8],[22,9,22,10],[23,9,23,10],[24,9,24,10],[25,9,25,10],[16,9,16,10],[17,9,17,10],[18,9,18,10],[19,9,19,10],[20,9,20,10],[15,9,15,10],[15,11,15,12],[9,9,9,10],[9,11,9,12],[8,5,8,12],[10,9,10,10],[10,11,10,12],[17,7,17,8],[18,3,18,4],[18,5,18,6],[18,7,18,8],[19,3,19,4],[19,5,19,6],[35,0,39,0],[20,3,20,4],[20,5,20,6],[20,7,20,8],[21,3,21,4],[21,5,21,6],[21,7,21,8],[22,3,22,4],[22,5,22,6],[22,7,22,8],[28,0,32,0],[16,0,25,0],[23,3,23,4],[24,3,24,4],[25,3,25,4],[17,3,17,4],[10,3,10,4],[10,5,10,6],[10,7,10,8],[19,7,19,8],[12,3,12,4],[12,5,12,6],[12,7,12,8],[13,3,13,4],[13,7,13,8],[15,3,15,4],[15,5,15,6],[15,7,15,8],[16,3,16,4],[16,5,16,6],[16,7,16,8],[17,5,17,6],[0,0,0,14],[1,0,1,14],[3,2,3,5],[5,2,5,5],[9,3,9,4],[9,5,9,6],[9,7,9,8],[3,11,3,12]]}
["ANNEXE 6 - SYNTHESE ANNUELLE DU MONITORING "]
["Suivi des espèces dans les réseaux écologiques"]
[]
["Numéro du réseau: ",null,null,null,null,null,null,"Les données ont été transmises à infospecies?",null,null,null,{"$f":"IF(ISBLANK('0-INFOS GENERALES A REMPLIR'!B19),\"pas d'information\",('0-INFOS GENERALES A REMPLIR'!B19))","v":"pas d'information"}]
[]
["Nom du réseau: ",null,{"$f":"'0-INFOS GENERALES A REMPLIR'!B6","v":0}]
[]
[]
[null,null,null,null,null,"A compléter si plusieurs parcours la même année"]
[null,null,"Année :",{"$f":"'0-INFOS GENERALES A REMPLIR'!B4","v":2021}]
[null,null,"N° de parcours :",{"$f":"IF('2-OISEAUX'!C6<>\"\",'2-OISEAUX'!C6)","v":0},null,{"$f":"IF('2-OISEAUX'!F6<>\"\",'2-OISEAUX'!F6)","v":0},null,{"$f":"IF('2-OISEAUX'!I6<>\"\",'2-OISEAUX'!I6,\"\")","v":0},null,{"$f":"IF('2-OISEAUX'!L6<>\"\",'2-OISEAUX'!L6)","v":0},null,{"$f":"IF('2-OISEAUX'!O6<>\"\",'2-OISEAUX'!O6)","v":0}]
[]
[null,null,null,"Indice",null,null,null,null,null,null,null,null,null,null,null,null,"Validation interne"]
["Mammifères",{"$f":"VLOOKUP('1-LIEVRE BRUN'!$A2,'listes valeurs'!$AF$2:$AI$3450,4)","v":"Lepus europaeus"},{"$f":"VLOOKUP('1-LIEVRE BRUN'!$A2,'listes valeurs'!$AF$2:$AI$3450,2)","v":"Lièvre brun"},{"$f":"'1-LIEVRE BRUN'!B22","v":{"$error":"#DIV/0!"}}]
[]
[null,null,null,"Nombre de territoires",null,"Nombre de territoires",null,"Nombre de territoires",null,"Nombre de territoires",null,"Nombre de territoires",null,null,"TOTAL",null,"Validation interne"]
["Oiseaux",{"$f":"IF(ISBLANK('2-OISEAUX'!$A16),\"\",VLOOKUP('2-OISEAUX'!$A16,'listes valeurs'!$T$2:$W$3450,4))","v":"Alauda arvensis                         "},{"$f":"IF(ISBLANK('2-OISEAUX'!$A16),\"\",VLOOKUP('2-OISEAUX'!$A16,'listes valeurs'!$T$2:$W$3450,2))","v":"Alouette des champs"},{"$f":"'2-OISEAUX'!C16","v":0},null,{"$f":"'2-OISEAUX'!F16","v":0},null,{"$f":"'2-OISEAUX'!I16","v":0},null,{"$f":"'2-OISEAUX'!L16","v":0},null,{"$f":"'2-OISEAUX'!O16","v":0},null,null,{"$f":"SUM(D17:M17)","v":0}]
[null,{"$f":"IF(ISBLANK('2-OISEAUX'!$A17),\"\",VLOOKUP('2-OISEAUX'!$A17,'listes valeurs'!$T$2:$W$3450,4))","v":"Emberiza citrinella                     "},{"$f":"IF(ISBLANK('2-OISEAUX'!$A17),\"\",VLOOKUP('2-OISEAUX'!$A17,'listes valeurs'!$T$2:$W$3450,2))","v":"Bruant jaune"},{"$f":"'2-OISEAUX'!C17","v":0},null,{"$f":"'2-OISEAUX'!F17","v":0},null,{"$f":"'2-OISEAUX'!I17","v":0},null,{"$f":"'2-OISEAUX'!L17","v":0},null,{"$f":"'2-OISEAUX'!O17","v":0},null,null,{"$f":"SUM(D18:M18)","v":0}]
[null,{"$f":"IF(ISBLANK('2-OISEAUX'!$A18),\"\",VLOOKUP('2-OISEAUX'!$A18,'listes valeurs'!$T$2:$W$3450,4))","v":"Emberiza calandra                       "},{"$f":"IF(ISBLANK('2-OISEAUX'!$A18),\"\",VLOOKUP('2-OISEAUX'!$A18,'listes valeurs'!$T$2:$W$3450,2))","v":"Bruant proyer"},{"$f":"'2-OISEAUX'!C18","v":0},null,{"$f":"'2-OISEAUX'!F18","v":0},null,{"$f":"'2-OISEAUX'!I18","v":0},null,{"$f":"'2-OISEAUX'!L18","v":0},null,{"$f":"'2-OISEAUX'!O18","v":0},null,null,0]
[null,{"$f":"IF(ISBLANK('2-OISEAUX'!$A19),\"\",VLOOKUP('2-OISEAUX'!$A19,'listes valeurs'!$T$2:$W$3450,4))","v":"Lanius collurio                         "},{"$f":"IF(ISBLANK('2-OISEAUX'!$A19),\"\",VLOOKUP('2-OISEAUX'!$A19,'listes valeurs'!$T$2:$W$3450,2))","v":"Pie-grièche écorcheur"},{"$f":"'2-OISEAUX'!C19","v":0},null,{"$f":"'2-OISEAUX'!F19","v":0},null,{"$f":"'2-OISEAUX'!I19","v":0},null,{"$f":"'2-OISEAUX'!L19","v":0},null,{"$f":"'2-OISEAUX'!O19","v":0},null,null,0]
[null,{"$f":"IF(ISBLANK('2-OISEAUX'!$A20),\"\",VLOOKUP('2-OISEAUX'!$A20,'listes valeurs'!$T$2:$W$3450,4))","v":"Jynx torquilla                          "},{"$f":"IF(ISBLANK('2-OISEAUX'!$A20),\"\",VLOOKUP('2-OISEAUX'!$A20,'listes valeurs'!$T$2:$W$3450,2))","v":"Torcol fourmilier"},{"$f":"'2-OISEAUX'!C20","v":0},null,{"$f":"'2-OISEAUX'!F20","v":0},null,{"$f":"'2-OISEAUX'!I20","v":0},null,{"$f":"'2-OISEAUX'!L20","v":0},null,{"$f":"'2-OISEAUX'!O20","v":0},null,null,0]
[null,{"$f":"IF(ISBLANK('2-OISEAUX'!$A21),\"\",VLOOKUP('2-OISEAUX'!$A21,'listes valeurs'!$T$2:$W$3450,4))","v":"Saxicola rubetra                        "},{"$f":"IF(ISBLANK('2-OISEAUX'!$A21),\"\",VLOOKUP('2-OISEAUX'!$A21,'listes valeurs'!$T$2:$W$3450,2))","v":"Tarier des prés"},{"$f":"'2-OISEAUX'!C21","v":0},null,{"$f":"'2-OISEAUX'!F21","v":0},null,{"$f":"'2-OISEAUX'!I21","v":0},null,{"$f":"'2-OISEAUX'!L21","v":0},null,{"$f":"'2-OISEAUX'!O21","v":0},null,null,0]
[null,{"$f":"IF(ISBLANK('2-OISEAUX'!$A22),\"\",VLOOKUP('2-OISEAUX'!$A22,'listes valeurs'!$T$2:$W$3450,4))","v":"Saxicola rubicola"},{"$f":"IF(ISBLANK('2-OISEAUX'!$A22),\"\",VLOOKUP('2-OISEAUX'!$A22,'listes valeurs'!$T$2:$W$3450,2))","v":"Tarier pâtre"},{"$f":"'2-OISEAUX'!C22","v":0},null,{"$f":"'2-OISEAUX'!F22","v":0},null,{"$f":"'2-OISEAUX'!I22","v":0},null,{"$f":"'2-OISEAUX'!L22","v":0},null,{"$f":"'2-OISEAUX'!O22","v":0},null,null,0]
[null,{"$f":"IF(ISBLANK('2-OISEAUX'!$A23),\"\",VLOOKUP('2-OISEAUX'!$A23,'listes valeurs'!$T$2:$W$3450,4))","v":""},{"$f":"IF(ISBLANK('2-OISEAUX'!$A23),\"\",VLOOKUP('2-OISEAUX'!$A23,'listes valeurs'!$T$2:$W$3450,2))","v":""},{"$f":"'2-OISEAUX'!C23","v":0},null,{"$f":"'2-OISEAUX'!F23","v":0},null,{"$f":"'2-OISEAUX'!I23","v":0},null,{"$f":"'2-OISEAUX'!L23","v":0},null,{"$f":"'2-OISEAUX'!O23","v":0},null,null,0]
[null,{"$f":"IF(ISBLANK('2-OISEAUX'!$A24),\"\",VLOOKUP('2-OISEAUX'!$A24,'listes valeurs'!$T$2:$W$3450,4))","v":""},{"$f":"IF(ISBLANK('2-OISEAUX'!$A24),\"\",VLOOKUP('2-OISEAUX'!$A24,'listes valeurs'!$T$2:$W$3450,2))","v":""},{"$f":"'2-OISEAUX'!C24","v":0},null,{"$f":"'2-OISEAUX'!F24","v":0},null,{"$f":"'2-OISEAUX'!I24","v":0},null,{"$f":"'2-OISEAUX'!L24","v":0},null,{"$f":"'2-OISEAUX'!O24","v":0},null,null,0]
[null,{"$f":"IF(ISBLANK('2-OISEAUX'!$A25),\"\",VLOOKUP('2-OISEAUX'!$A25,'listes valeurs'!$T$2:$W$3450,4))","v":""},{"$f":"IF(ISBLANK('2-OISEAUX'!$A25),\"\",VLOOKUP('2-OISEAUX'!$A25,'listes valeurs'!$T$2:$W$3450,2))","v":""},{"$f":"'2-OISEAUX'!C25","v":0},null,{"$f":"'2-OISEAUX'!F25","v":0},null,{"$f":"'2-OISEAUX'!I25","v":0},null,{"$f":"'2-OISEAUX'!L25","v":0},null,{"$f":"'2-OISEAUX'!O25","v":0},null,null,0]
[]
[null,null,null,"Total IN","Total OUT","Total IN","Total OUT","Total IN","Total OUT","Total IN","Total OUT","Total IN","Total",null,"TOTAL",null,"Validation interne"]
["Papillons",{"$f":"VLOOKUP('3-PAPILLONS'!A18,'listes valeurs'!$X$2:$AA$3450,4)","v":"Melanargia galathea"},{"$f":"VLOOKUP('3-PAPILLONS'!A18,'listes valeurs'!$X$2:$AA$3450,2)","v":"Demi-deuil"},{"$f":"'3-PAPILLONS'!H18","v":0},{"$f":"'3-PAPILLONS'!I18","v":0},{"$f":"'3-PAPILLONS'!H54","v":0},{"$f":"'3-PAPILLONS'!I54","v":0},{"$f":"'3-PAPILLONS'!H54","v":0},{"$f":"'3-PAPILLONS'!I54","v":0},{"$f":"'3-PAPILLONS'!H90","v":0},{"$f":"'3-PAPILLONS'!I90","v":0},{"$f":"'3-PAPILLONS'!H126","v":0},{"$f":"'3-PAPILLONS'!I126","v":0},null,{"$f":"SUM(D29:M29)","v":0}]
[null,{"$f":"VLOOKUP('3-PAPILLONS'!A19,'listes valeurs'!$X$2:$AA$3450,4)","v":"Maniola jurtina"},{"$f":"VLOOKUP('3-PAPILLONS'!A19,'listes valeurs'!$X$2:$AA$3450,2)","v":"Myrtil"},{"$f":"'3-PAPILLONS'!H19","v":0},{"$f":"'3-PAPILLONS'!I19","v":0},{"$f":"'3-PAPILLONS'!H55","v":0},{"$f":"'3-PAPILLONS'!I55","v":0},{"$f":"'3-PAPILLONS'!H55","v":0},{"$f":"'3-PAPILLONS'!I55","v":0},{"$f":"'3-PAPILLONS'!H91","v":0},{"$f":"'3-PAPILLONS'!I91","v":0},{"$f":"'3-PAPILLONS'!H127","v":0},{"$f":"'3-PAPILLONS'!I127","v":0},null,0]
[null,{"$f":"VLOOKUP('3-PAPILLONS'!A20,'listes valeurs'!$X$2:$AA$3450,4)","v":"Brintesia circe"},{"$f":"VLOOKUP('3-PAPILLONS'!A20,'listes valeurs'!$X$2:$AA$3450,2)","v":"Silène"},{"$f":"'3-PAPILLONS'!H20","v":0},{"$f":"'3-PAPILLONS'!I20","v":0},{"$f":"'3-PAPILLONS'!H56","v":0},{"$f":"'3-PAPILLONS'!I56","v":0},{"$f":"'3-PAPILLONS'!H56","v":0},{"$f":"'3-PAPILLONS'!I56","v":0},{"$f":"'3-PAPILLONS'!H92","v":0},{"$f":"'3-PAPILLONS'!I92","v":0},{"$f":"'3-PAPILLONS'!H128","v":0},{"$f":"'3-PAPILLONS'!I128","v":0},null,0]
[null,{"$f":"VLOOKUP('3-PAPILLONS'!A21,'listes valeurs'!$X$2:$AA$3450,4)","v":"Aphantopus hyperantus"},{"$f":"VLOOKUP('3-PAPILLONS'!A21,'listes valeurs'!$X$2:$AA$3450,2)","v":"Tristan"},{"$f":"'3-PAPILLONS'!H21","v":0},{"$f":"'3-PAPILLONS'!I21","v":0},{"$f":"'3-PAPILLONS'!H57","v":0},{"$f":"'3-PAPILLONS'!I57","v":0},{"$f":"'3-PAPILLONS'!H57","v":0},{"$f":"'3-PAPILLONS'!I57","v":0},{"$f":"'3-PAPILLONS'!H93","v":0},{"$f":"'3-PAPILLONS'!I93","v":0},{"$f":"'3-PAPILLONS'!H129","v":0},{"$f":"'3-PAPILLONS'!I129","v":0},null,0]
[null,{"$f":"VLOOKUP('3-PAPILLONS'!A22,'listes valeurs'!$X$2:$AA$3450,4)","v":"Brenthis ino"},{"$f":"VLOOKUP('3-PAPILLONS'!A22,'listes valeurs'!$X$2:$AA$3450,2)","v":"Nacré de la sanguisorbe"},{"$f":"'3-PAPILLONS'!H22","v":0},{"$f":"'3-PAPILLONS'!I22","v":0},{"$f":"'3-PAPILLONS'!H58","v":0},{"$f":"'3-PAPILLONS'!I58","v":0},{"$f":"'3-PAPILLONS'!H58","v":0},{"$f":"'3-PAPILLONS'!I58","v":0},{"$f":"'3-PAPILLONS'!H94","v":0},{"$f":"'3-PAPILLONS'!I94","v":0},{"$f":"'3-PAPILLONS'!H130","v":0},{"$f":"'3-PAPILLONS'!I130","v":0},null,{"$f":"SUM(D33:M33)","v":0}]
[]
[null,null,null,"% présence dans SPB","Présence hors SPB (oui/non)",null,null,null,null,null,null,null,null,null,null,null,"Validation interne"]
["Plantes",{"$f":"VLOOKUP('4-PLANTES'!B$17,'listes valeurs'!$AB$2:$AE$3450,4)","v":"Silene noctiflora"},{"$f":"VLOOKUP('4-PLANTES'!B$17,'listes valeurs'!$AB$2:$AE$3450,2)","v":"Silène de nuit"},{"$f":"'4-PLANTES'!B34","v":{"$error":"#DIV/0!"}},{"$f":"'4-PLANTES'!B35","v":0}]
[null,{"$f":"VLOOKUP('4-PLANTES'!C$17,'listes valeurs'!$AB$2:$AE$3450,4)","v":"Kickxia spuria"},{"$f":"VLOOKUP('4-PLANTES'!C$17,'listes valeurs'!$AB$2:$AE$3450,2)","v":"Linaire bâtarde"},{"$f":"'4-PLANTES'!C$34","v":{"$error":"#DIV/0!"}},{"$f":"'4-PLANTES'!C35","v":0}]
[null,{"$f":"IF(ISBLANK('4-PLANTES'!D$17),\"\",VLOOKUP('4-PLANTES'!D$17,'listes valeurs'!$AB$2:$AE$3450,4))","v":""},{"$f":"IF(ISBLANK('4-PLANTES'!D$17),\"\",VLOOKUP('4-PLANTES'!D$17,'listes valeurs'!$AB$2:$AE$3450,2))","v":""},{"$f":"'4-PLANTES'!D$34","v":0},{"$f":"'4-PLANTES'!D35","v":0}]
[null,{"$f":"IF(ISBLANK('4-PLANTES'!E$17),\"\",VLOOKUP('4-PLANTES'!E$17,'listes valeurs'!$AB$2:$AE$3450,4))","v":""},{"$f":"IF(ISBLANK('4-PLANTES'!E$17),\"\",VLOOKUP('4-PLANTES'!E$17,'listes valeurs'!$AB$2:$AE$3450,2))","v":""},{"$f":"'4-PLANTES'!E$34","v":0},{"$f":"'4-PLANTES'!E35","v":0}]
[null,{"$f":"IF(ISBLANK('4-PLANTES'!F$17),\"\",VLOOKUP('4-PLANTES'!F$17,'listes valeurs'!$AB$2:$AE$3450,4))","v":""},{"$f":"IF(ISBLANK('4-PLANTES'!F$17),\"\",VLOOKUP('4-PLANTES'!F$17,'listes valeurs'!$AB$2:$AE$3450,2))","v":""},{"$f":"'4-PLANTES'!F$34","v":0},{"$f":"'4-PLANTES'!F35","v":0}]
[]
[null,null,null,"Nbre cumulé de contacts","Nbre de sites ",null,"TOTAL ",null,null,null,null,null,null,null,null,null,"Validation interne"]
["Reptiles",{"$f":"VLOOKUP('5-LEZARD AGILE'!$A$11,'listes valeurs'!$AJ$2:$AM$3450,4)","v":"Lacerta agilis"},{"$f":"VLOOKUP('5-LEZARD AGILE'!$A$11,'listes valeurs'!$AJ$2:$AM$3450,2)","v":"Lézard agile"},{"$f":"'5-LEZARD AGILE'!$C$11","v":0},{"$f":"'5-LEZARD AGILE'!$D$11","v":0},null,{"$f":"'5-LEZARD AGILE'!C11","v":0}]

{"sheet":"listes valeurs","index":7,"n_rows":1002,"n_cols":41,"rows_kept":1002,"cut":false,"hidden":false,"merged":[]}
["Num_réseau","Nom_réseau actuel","Nom_sous_réseau","Année_tirage_au_sort","Num_parcours","Longueur parcours","Code__Parcours","Liste réseaux","Conditions météo durant le parcours : ","dates oiseaux et pap.",null,"durée oiseaux","dates II papillons",null,"heures oiseaux","heures papillon","durée pap","date plantes",null,"Oiseaux code","Oiseaux espèce français","Oiseaux groupe","Oiseaux espèce latin","Papillons code","Papillons espèce français","Papillons groupe","Papillons espèce latin","Plante code","Plantes espèce français","Plantes groupe","Plantes espèce latin","Mammifère code","Mammifère espèce français","Mammifère groupe","Mammifère espèce latin","Reptiles code","Reptiles espèce français","Reptiles groupe","Reptiles espèce latin","Oui/Non","Validation interne"]
[84,"Arnon ","Arnon",2018,1,4297,"R084_P01","Arnon ","0 = détérioration ayant entraîné l’abandon du travail (relevé à refaire)",15,5,180,1,7,"05:00:00","10:00:00",180,1,7,"ACA   ","Accenteur alpin","Oiseaux","Prunella collaris                       ","DEM","Demi-deuil","Papillons","Melanargia galathea","KICKXIA","Linaire bâtarde","Plantes","Kickxia spuria","LIEVRE BRUN","Lièvre brun","Mammifères","Lepus europaeus","Lacerta agilis","Lézard agile","Reptiles","Lacerta agilis","oui","OK"]
[84,"Arnon ","Arnon",2018,2,3831,"R084_P02","Assens","1 = conditions médiocres",15,6,180,15,8,"11:00:00","17:00:00",240,15,8,"ACM   ","Accenteur mouchet","Oiseaux","Prunella modularis                      ","MYR","Myrtil","Papillons","Maniola jurtina","SILENE","Silène de nuit","Plantes","Silene noctiflora",null,null,null,null,null,null,null,null,"non","douteux/à vérifier"]
[84,"Arnon ","Arnon",2018,3,3486,"R084_P03","Aubonne-La Côte","2 = conditions moyennes",null,null,null,null,null,null,null,null,null,null,"AIG   ","Aigle royal","Oiseaux","Aquila chrysaetos                       ","NAC","Nacré de la sanguisorbe","Papillons","Brenthis ino"]
[84,"Arnon ","Arnon",2018,4,4651,"R084_P04","Augine","3 = conditions bonnes",null,null,null,null,null,null,null,null,null,null,"ALC","Alouette des champs","Oiseaux","Alauda arvensis                         ","SIL","Silène","Papillons","Brintesia circe"]
[111,"Assens","Assens",2019,1,3400,"R111_P01","Balcon du Léman",null,null,null,null,null,null,null,null,null,null,null,"ALL   ","Alouette lulu","Oiseaux","Lullula arborea                         ","TRI","Tristan","Papillons","Aphantopus hyperantus"]
[111,"Assens","Assens",2019,2,3400,"R111_P02","Ballaigues Lignerolle",null,null,null,null,null,null,null,null,null,null,null,"AUT   ","Autour des palombes","Oiseaux","Accipiter gentilis                      "]
[27,"Aubonne-La Côte","Aubonne-La Côte",2019,1,3883,"R027_P01","Basse-Menthue",null,null,null,null,null,null,null,null,null,null,null,"BAL   ","Balbuzard pêcheur","Oiseaux","Pandion haliaetus                       "]
[27,"Aubonne-La Côte","Aubonne-La Côte",2019,2,3636,"R027_P02","Baumaz",null,null,null,null,null,null,null,null,null,null,null,"BCS   ","Bec-croisé des sapins","Oiseaux","Loxia curvirostra                       "]
[27,"Aubonne-La Côte","Aubonne-La Côte",2019,3,3086,"R027_P03","Baumine",null,null,null,null,null,null,null,null,null,null,null,"BEB   ","Bécasse des bois","Oiseaux","Scolopax rusticola                      "]
[27,"Aubonne-La Côte","Aubonne-La Côte",2019,4,3145,"R027_P04","Bochuz",null,null,null,null,null,null,null,null,null,null,null,"BEC   ","Bergeronnette citrine","Oiseaux","Motacilla citreola                      "]
[27,"Aubonne-La Côte","Aubonne-La Côte",2019,5,3172,"R027_P05","Boiron de Morges",null,null,null,null,null,null,null,null,null,null,null,"BEG   ","Bergeronnette grise","Oiseaux","Motacilla alba                          "]
[27,"Aubonne-La Côte","Aubonne-La Côte",2019,6,3419,"R027_P06","Boulens St-Cierges",null,null,null,null,null,null,null,null,null,null,null,"BEM   ","Bécassine des marais","Oiseaux","Gallinago gallinago                     "]
[27,"Aubonne-La Côte","Aubonne-La Côte",2019,7,3980,"R027_P07","Bullet Mauborget",null,null,null,null,null,null,null,null,null,null,null,"BEP   ","Bergeronnette printanière","Oiseaux","Motacilla flava                         "]
[27,"Aubonne-La Côte","Aubonne-La Côte",2019,8,3333,"R027_P08","Buron et environs",null,null,null,null,null,null,null,null,null,null,null,"BER   ","Bergeronnette des ruisseaux","Oiseaux","Motacilla cinerea                       "]
[27,"Aubonne-La Côte","Aubonne-La Côte",2019,9,3418,"R027_P09","CABA",null,null,null,null,null,null,null,null,null,null,null,"BIH   ","Bihoreau gris","Oiseaux","Nycticorax nycticorax                   "]
[27,"Aubonne-La Côte","Aubonne-La Côte",2019,10,3992,"R027_P10","Carrouge_Servion et environs",null,null,null,null,null,null,null,null,null,null,null,"BLO   ","Blongios nain","Oiseaux","Ixobrychus minutus                      "]
[27,"Aubonne-La Côte","Aubonne-La Côte",2019,11,4537,"R027_P11","Centre",null,null,null,null,null,null,null,null,null,null,null,"BOC   ","Bouscarle de Cetti","Oiseaux","Cettia cetti                            "]
[27,"Aubonne-La Côte","Aubonne-La Côte",2019,12,3719,"R027_P12","Champagne",null,null,null,null,null,null,null,null,null,null,null,"BON   ","Bondrée apivore","Oiseaux","Pernis apivorus                         "]
[27,"Aubonne-La Côte","Aubonne-La Côte",2019,13,4013,"R027_P13","Champvent_Chamblon",null,null,null,null,null,null,null,null,null,null,null,"BOU   ","Bouvreuil pivoine","Oiseaux","Pyrrhula pyrrhula                       "]
[27,"Aubonne-La Côte","Aubonne-La Côte",2019,14,3337,"R027_P14","Chavornay ",null,null,null,null,null,null,null,null,null,null,null,"BRF   ","Bruant fou","Oiseaux","Emberiza cia                            "]
[92,"Augine","Augine",2019,2,3192,"R092_P02","Chouette-Cigale",null,null,null,null,null,null,null,null,null,null,null,"BRJ","Bruant jaune","Oiseaux","Emberiza citrinella                     "]
[92,"Augine","Augine",2019,3,3300,"R092_P03","Concise",null,null,null,null,null,null,null,null,null,null,null,"BRO   ","Bruant ortolan","Oiseaux","Emberiza hortulana                      "]
[101,"Balcon du Léman","Balcon du Léman",2019,1,3861,"R101_P01","Cœur de la Cote",null,null,null,null,null,null,null,null,null,null,null,"BRP","Bruant proyer","Oiseaux","Emberiza calandra                       "]
[101,"Balcon du Léman","Balcon du Léman",2019,2,3854,"R101_P02","Corcelles-le-Jorat et environs",null,null,null,null,null,null,null,null,null,null,null,"BRR   ","Bruant des roseaux","Oiseaux","Emberiza schoeniclus                    "]
[101,"Balcon du Léman","Balcon du Léman",2019,3,3734,"R101_P03","Creux du Van",null,null,null,null,null,null,null,null,null,null,null,"BRZ   ","Bruant zizi","Oiseaux","Emberiza cirlus                         "]
[101,"Balcon du Léman","Balcon du Léman",2019,4,3936,"R101_P04","Curtilles",null,null,null,null,null,null,null,null,null,null,null,"BUC   ","Busard cendré","Oiseaux","Circus pygargus                         "]
[74,"Ballaigues Lignerolle","Ballaigues Lignerolle",2018,1,4317,"R074_P01","Démoret Molondin",null,null,null,null,null,null,null,null,null,null,null,"BUM   ","Busard Saint-Martin","Oiseaux","Circus cyaneus                          "]
[74,"Ballaigues Lignerolle","Ballaigues Lignerolle",2018,2,4390,"R074_P02","Donatyre Avenches",null,null,null,null,null,null,null,null,null,null,null,"BUR   ","Busard des roseaux","Oiseaux","Circus aeruginosus                      "]
[74,"Ballaigues Lignerolle","Ballaigues Lignerolle",2018,3,4040,"R074_P03","Faoug",null,null,null,null,null,null,null,null,null,null,null,"BUV   ","Buse variable","Oiseaux","Buteo buteo                             "]
[37,"Basse-Menthue","Basse-Menthue",2017,1,3866,"R037_P01","Fey Bercher Rueyres",null,null,null,null,null,null,null,null,null,null,null,"CAI   ","Caille des blés","Oiseaux","Coturnix coturnix                       "]
[37,"Basse-Menthue","Basse-Menthue",2017,2,3165,"R037_P02","Frontière",null,null,null,null,null,null,null,null,null,null,null,"CAL   ","Alouette calandrelle","Oiseaux","Calandrella brachydactyla               "]
[37,"Basse-Menthue","Basse-Menthue",2017,3,3832,"R037_P03","Grandcour_Chevroux",null,null,null,null,null,null,null,null,null,null,null,"CAS   ","Cassenoix moucheté","Oiseaux","Nucifraga caryocatactes                 "]
[53,"Baumaz","Baumaz",2018,1,3440,"R053_P01","Granges Sassel Menieres",null,null,null,null,null,null,null,null,null,null,null,"CBJ   ","Chocard à bec jaune","Oiseaux","Pyrrhocorax graculus                    "]
[53,"Baumaz","Baumaz",2018,2,3442,"R053_P02","Haut-Jorat",null,null,null,null,null,null,null,null,null,null,null,"CBR   ","Crave à bec rouge","Oiseaux","Pyrrhocorax pyrrhocorax                 "]
[53,"Baumaz","Baumaz",2018,3,3986,"R053_P03","Hauts de Moudon",null,null,null,null,null,null,null,null,null,null,null,"CHA   ","Chardonneret élégant","Oiseaux","Carduelis carduelis                     "]
[83,"Baumine","Baumine",2018,1,4015,"R083_P01","Henniez et environs",null,null,null,null,null,null,null,null,null,null,null,"CHI   ","Canard chipeau","Oiseaux","Anas strepera                           "]
[83,"Baumine","Baumine",2018,2,4191,"R083_P02","Lavaux-Jorat",null,null,null,null,null,null,null,null,null,null,null,"CHO   ","Choucas des tours","Oiseaux","Corvus monedula                         "]
[83,"Baumine","Baumine",2018,3,4034,"R083_P03","Le Reculet",null,null,null,null,null,null,null,null,null,null,null,"CHT   ","Chevêchette d'Europe","Oiseaux","Glaucidium passerinum                   "]
[83,"Baumine","Baumine",2018,4,3733,"R083_P04","Les Monod",null,null,null,null,null,null,null,null,null,null,null,"CHV   ","Chevêche d'Athéna","Oiseaux","Athene noctua                           "]
[135,"Bochuz","Bochuz",2016,1,4375,"R135_P01","Les Ormonts Leysin Corbeyrier",null,null,null,null,null,null,null,null,null,null,null,"CIG   ","Cigogne blanche","Oiseaux","Ciconia ciconia                         "]
[135,"Bochuz","Bochuz",2016,2,3115,"R135_P01","Les Vaux",null,null,null,null,null,null,null,null,null,null,null,"CIN   ","Cincle plongeur","Oiseaux","Cinclus cinclus                         "]
[19,"Boiron de Morges","Boiron de Morges",2023,null,null,null,"Lièvre",null,null,null,null,null,null,null,null,null,null,null,"CIR   ","Circaète Jean-le-Blanc","Oiseaux","Circaetus gallicus                      "]
[35,"Boulens St-Cierges","Boulens St-Cierges",2017,1,4102,"R035_P01","Mathod Suscévaz",null,null,null,null,null,null,null,null,null,null,null,"CIS   ","Cisticole des joncs","Oiseaux","Cisticola juncidis                      "]
[35,"Boulens St-Cierges","Boulens St-Cierges",2017,2,4256,"R035_P02","Merdasson",null,null,null,null,null,null,null,null,null,null,null,"CMA   ","Canard mandarin","Oiseaux","Aix galericulata                        "]
[33,"Bullet Mauborget","Bullet Mauborget",2017,1,3659,"R033_P01","Missy",null,null,null,null,null,null,null,null,null,null,null,"COC   ","Courlis cendré","Oiseaux","Numenius arquata                        "]
[33,"Bullet Mauborget","Bullet Mauborget",2018,2,3761,"R033_P02","Montaubion-Chardonney",null,null,null,null,null,null,null,null,null,null,null,"COF   ","Corbeau freux","Oiseaux","Corvus frugilegus                       "]
[33,"Bullet Mauborget","Bullet Mauborget",2018,3,3192,"R033_P03","Montélaz",null,null,null,null,null,null,null,null,null,null,null,"COH   ","Cochevis huppé","Oiseaux","Galerida cristata                       "]
[33,"Bullet Mauborget","Bullet Mauborget",2018,4,3422,"R033_P04","Mont-Pèlerin",null,null,null,null,null,null,null,null,null,null,null,"COL   ","Canard colvert","Oiseaux","Anas platyrhynchos                      "]
[68,"Buron et environs","Buron et environs",2018,1,3875,"R068_P01","Muverans",null,null,null,null,null,null,null,null,null,null,null,"COM","Corneille mantelée","Oiseaux","Corvus cornix"]
[68,"Buron et environs","Buron et environs",2018,2,4115,"R068_P02","Nozon",null,null,null,null,null,null,null,null,null,null,null,"CON","Corneille noire","Oiseaux","Corvus corone                           "]
[68,"Buron et environs","Buron et environs",2018,3,3883,"R068_P03","Nyon Région",null,null,null,null,null,null,null,null,null,null,null,"COU   ","Coucou gris","Oiseaux","Cuculus canorus                         "]
[68,"Buron et environs","Buron et environs",2018,4,3769,"R068_P04","Onnens Bonvillars",null,null,null,null,null,null,null,null,null,null,null,"CRE   ","Faucon crécerelle","Oiseaux","Falco tinnunculus                       "]
[68,"Buron et environs","Buron et environs",2018,5,3721,"R068_P05","Oron",null,null,null,null,null,null,null,null,null,null,null,"CYG   ","Cygne tuberculé","Oiseaux","Cygnus olor                             "]
[68,"Buron et environs","Buron et environs",2018,6,4017,"R068_P06","Payerne et environs",null,null,null,null,null,null,null,null,null,null,null,"ECH   ","Echasse blanche","Oiseaux","Himantopus himantopus                   "]
[29,"CABA","CABA",2017,1,4050,"R029_P01","Pays d'Enhaut",null,null,null,null,null,null,null,null,null,null,null,"EFF   ","Effraie des clochers","Oiseaux","Tyto alba                               "]
[29,"CABA","CABA",2017,2,3530,"R029_P02","Petit Flon",null,null,null,null,null,null,null,null,null,null,null,"EID   ","Eider à duvet","Oiseaux","Somateria mollissima                    "]
[29,"CABA","CABA",2017,3,3160,"R029_P03","Petite Glâne Vaudoise - Combremont",null,null,null,null,null,null,null,null,null,null,null,"ENG   ","Engoulevent d'Europe","Oiseaux","Caprimulgus europaeus                   "]
[29,"CABA","CABA",2017,4,3820,"R029_P04","Pied du Jura",null,null,null,null,null,null,null,null,null,null,null,"EPE   ","Epervier d'Europe","Oiseaux","Accipiter nisus                         "]
[29,"CABA","CABA",2017,5,3930,"R029_P05","Plaine du Rhône Sud",null,null,null,null,null,null,null,null,null,null,null,"ETO   ","Etourneau sansonnet","Oiseaux","Sturnus vulgaris                        "]
[29,"CABA","CABA",2017,6,3340,"R029_P06","Pomy et environs",null,null,null,null,null,null,null,null,null,null,null,"FAB   ","Fauvette babillarde","Oiseaux","Sylvia curruca                          "]
[29,"CABA","CABA",2017,7,4020,"R029_P07","Puidoux",null,null,null,null,null,null,null,null,null,null,null,"FAE   ","Fauvette épervière","Oiseaux","Sylvia nisoria                          "]
[29,"CABA","CABA",2017,8,4130,"R029_P08","Rochers de Naye",null,null,null,null,null,null,null,null,null,null,null,"FAG   ","Fauvette grisette","Oiseaux","Sylvia communis                         "]
[29,"CABA","CABA",2017,9,4130,"R029_P09","Saubrette",null,null,null,null,null,null,null,null,null,null,null,"FAI   ","Faisan de Colchide","Oiseaux","Phasianus colchicus                     "]
[29,"CABA","CABA",2017,10,3820,"R029_P10","Serine",null,null,null,null,null,null,null,null,null,null,null,"FAJ   ","Fauvette des jardins","Oiseaux","Sylvia borin                            "]
[29,"CABA","CABA",2017,11,4500,"R029_P11","Ste-Croix",null,null,null,null,null,null,null,null,null,null,null,"FAL   ","Fauvette à lunettes","Oiseaux","Sylvia conspicillata                    "]
[29,"CABA","CABA",2017,12,3900,"R029_P12","Syens",null,null,null,null,null,null,null,null,null,null,null,"FAO   ","Fauvette orphée","Oiseaux","Sylvia hortensis                        "]
[64,"Carrouge_Servion et environs","Carrouge_Servion et environs",2018,1,3814,"R064_P01","Terre Sainte",null,null,null,null,null,null,null,null,null,null,null,"FAP   ","Fauvette passerinette","Oiseaux","Sylvia cantillans                       "]
[64,"Carrouge_Servion et environs","Carrouge_Servion et environs",2018,2,3715,"R064_P02","Tévenon",null,null,null,null,null,null,null,null,null,null,null,"FMI   ","Fuligule milouin","Oiseaux","Aythya ferina                           "]
[64,"Carrouge_Servion et environs","Carrouge_Servion et environs",2018,3,3358,"R064_P03","Tour Blanche",null,null,null,null,null,null,null,null,null,null,null,"FMO   ","Fuligule morillon","Oiseaux","Aythya fuligula                         "]
[64,"Carrouge_Servion et environs","Carrouge_Servion et environs",2018,4,4052,"R064_P04","Trois Rivières",null,null,null,null,null,null,null,null,null,null,null,"FNY   ","Fuligule nyroca","Oiseaux","Aythya nyroca                           "]
[64,"Carrouge_Servion et environs","Carrouge_Servion et environs",2018,5,3808,"R064_P05","Valeyres-Sous-Rances",null,null,null,null,null,null,null,null,null,null,null,"FOU   ","Foulque macroule","Oiseaux","Fulica atra                             "]
[64,"Carrouge_Servion et environs","Carrouge_Servion et environs",2018,6,3824,"R064_P06","Vallée de Joux",null,null,null,null,null,null,null,null,null,null,null,"FTN   ","Fauvette à tête noire","Oiseaux","Sylvia atricapilla                      "]
[64,"Carrouge_Servion et environs","Carrouge_Servion et environs",2018,7,3732,"R064_P07","Vallon de la Greyle",null,null,null,null,null,null,null,null,null,null,null,"GAL   ","Gallinule poule-d'eau","Oiseaux","Gallinula chloropus                     "]
[64,"Carrouge_Servion et environs","Carrouge_Servion et environs",2018,8,4098,"R064_P08","Vallorbe",null,null,null,null,null,null,null,null,null,null,null,"GAM   ","Chevalier gambette","Oiseaux","Tringa totanus                          "]
[64,"Carrouge_Servion et environs","Carrouge_Servion et environs",2018,9,3601,"R064_P09","Venoge Mormont",null,null,null,null,null,null,null,null,null,null,null,"GAR   ","Garrot à oeil d'or","Oiseaux","Bucephala clangula                      "]
[48,"Centre","Centre",2018,1,3422,"R048_P01","Veyron-Venoge-Dizy",null,null,null,null,null,null,null,null,null,null,null,"GCM   ","Grand Cormoran","Oiseaux","Phalacrocorax carbo                     "]
[48,"Centre","Centre",2018,2,3386,"R048_P02","Villars-le-Terroir",null,null,null,null,null,null,null,null,null,null,null,"GCN   ","Grèbe à cou noir","Oiseaux","Podiceps nigricollis                    "]
[48,"Centre","Centre",2018,3,3944,"R048_P03","Vully Diversité",null,null,null,null,null,null,null,null,null,null,null,"GCO   ","Grand Corbeau","Oiseaux","Corvus corax                            "]
[48,"Centre","Centre",2018,4,4061,"R048_P04",null,null,null,null,null,null,null,null,null,null,null,null,"GDU   ","Grand-duc d'Europe","Oiseaux","Bubo bubo                               "]
[48,"Centre","Centre",2018,5,4181,"R048_P05",null,null,null,null,null,null,null,null,null,null,null,null,"GEA   ","Geai des chênes","Oiseaux","Garrulus glandarius                     "]
[48,"Centre","Centre",2018,6,3901,"R048_P06",null,null,null,null,null,null,null,null,null,null,null,null,"GEL   ","Gélinotte des bois","Oiseaux","Tetrastes bonasia"]
[48,"Centre","Centre",2018,7,3490,"R048_P07",null,null,null,null,null,null,null,null,null,null,null,null,"GGR   ","Gobemouche gris","Oiseaux","Muscicapa striata                       "]
[120,"Champagne","Champagne",2022,null,null,null,null,null,null,null,null,null,null,null,null,null,null,null,"GMC   ","Gobemouche à collier","Oiseaux","Ficedula albicollis                     "]
[82,"Champvent_Chamblon","Champvent_Chamblon",2018,1,3920,"R082_P01",null,null,null,null,null,null,null,null,null,null,null,null,"GNA   ","Gobemouche nain","Oiseaux","Ficedula parva                          "]
[82,"Champvent_Chamblon","Champvent_Chamblon",2018,2,3586,"R082_P02",null,null,null,null,null,null,null,null,null,null,null,null,"GNO   ","Gobemouche noir","Oiseaux","Ficedula hypoleuca                      "]
[82,"Champvent_Chamblon","Champvent_Chamblon",2018,3,4596,"R082_P03",null,null,null,null,null,null,null,null,null,null,null,null,"GOC   ","Goéland cendré","Oiseaux","Larus canus                             "]
[82,"Champvent_Chamblon","Champvent_Chamblon",2018,4,3578,"R082_P04",null,null,null,null,null,null,null,null,null,null,null,null,"GOL   ","Goéland leucophée","Oiseaux","Larus michahellis                       "]
[82,"Champvent_Chamblon","Champvent_Chamblon",2018,5,4324,"R082_P05",null,null,null,null,null,null,null,null,null,null,null,null,"GOR   ","Gorgebleue à miroir","Oiseaux","Luscinia svecica                        "]
[90,"Chavornay ","Chavornay Corcelles Suchy Essert Pittet",2019,1,3000,"R090_P01",null,null,null,null,null,null,null,null,null,null,null,null,"GRA   ","Grande Aigrette","Oiseaux","Egretta alba                            "]
[90,"Chavornay ","Chavornay Corcelles Suchy Essert Pittet",2019,2,3700,"R090_P02",null,null,null,null,null,null,null,null,null,null,null,null,"GRB   ","Grimpereau des bois","Oiseaux","Certhia familiaris                      "]
[90,"Chavornay ","Chavornay Corcelles Suchy Essert Pittet",2019,3,3000,"R090_P03",null,null,null,null,null,null,null,null,null,null,null,null,"GRC   ","Grèbe castagneux","Oiseaux","Tachybaptus ruficollis                  "]
[90,"Chavornay ","Chavornay Corcelles Suchy Essert Pittet",2019,4,3500,"R090_P04",null,null,null,null,null,null,null,null,null,null,null,null,"GRD   ","Grive draine","Oiseaux","Turdus viscivorus                       "]
[90,"Chavornay ","Chavornay Corcelles Suchy Essert Pittet",2019,5,3500,"R090_P05",null,null,null,null,null,null,null,null,null,null,null,null,"GRH   ","Grèbe huppé","Oiseaux","Podiceps cristatus                      "]
[90,"Chavornay ","Chavornay Corcelles Suchy Essert Pittet",2019,6,4000,"R090_P06",null,null,null,null,null,null,null,null,null,null,null,null,"GRJ   ","Grimpereau des jardins","Oiseaux","Certhia brachydactyla                   "]
[57,"Chouette-Cigale","Chouette-Cigale",2018,1,3322,"R057_P01",null,null,null,null,null,null,null,null,null,null,null,null,"GRL   ","Grive litorne","Oiseaux","Turdus pilaris                          "]
[57,"Chouette-Cigale","Chouette-Cigale",2018,2,3345,"R057_P02",null,null,null,null,null,null,null,null,null,null,null,null,"GRM   ","Grive musicienne","Oiseaux","Turdus philomelos                       "]
[57,"Chouette-Cigale","Chouette-Cigale",2018,3,3112,"R057_P03",null,null,null,null,null,null,null,null,null,null,null,null,"GRO   ","Grosbec casse-noyaux","Oiseaux","Coccothraustes coccothraustes           "]
[57,"Chouette-Cigale","Chouette-Cigale",2018,4,3750,"R057_P04",null,null,null,null,null,null,null,null,null,null,null,null,"GTE   ","Grand Tétras","Oiseaux","Tetrao urogallus                        "]
[57,"Chouette-Cigale","Chouette-Cigale",2018,5,4038,"R057_P05",null,null,null,null,null,null,null,null,null,null,null,null,"GUE   ","Guêpier d'Europe","Oiseaux","Merops apiaster                         "]
[57,"Chouette-Cigale","Chouette-Cigale",2018,6,3962,"R057_P06",null,null,null,null,null,null,null,null,null,null,null,null,"GUI   ","Chevalier guignette","Oiseaux","Actitis hypoleucos                      "]
[57,"Chouette-Cigale","Chouette-Cigale",2018,7,3962,"R057_P07",null,null,null,null,null,null,null,null,null,null,null,null,"GYP   ","Gypaète barbu","Oiseaux","Gypaetus barbatus                       "]
[57,"Chouette-Cigale","Chouette-Cigale",2018,8,3904,"R057_P08",null,null,null,null,null,null,null,null,null,null,null,null,"HAB   ","Harle bièvre","Oiseaux","Mergus merganser                        "]
[121,"Concise","Concise",2022,null,null,null,null,null,null,null,null,null,null,null,null,null,null,null,"HAH   ","Harle huppé","Oiseaux","Mergus serrator                         "]
[105,"Cœur de la Cote","Cœur de la Cote",2019,1,null,"R105_P01",null,null,null,null,null,null,null,null,null,null,null,null,"HDM   ","Hibou des marais","Oiseaux","Asio flammeus                           "]
[105,"Cœur de la Cote","Cœur de la Cote",2019,2,null,"R105_P02",null,null,null,null,null,null,null,null,null,null,null,null,"HEC   ","Héron cendré","Oiseaux","Ardea cinerea                           "]
[105,"Cœur de la Cote","Cœur de la Cote",2019,3,null,"R105_P03",null,null,null,null,null,null,null,null,null,null,null,null,"HEP   ","Héron pourpré","Oiseaux","Ardea purpurea                          "]
[105,"Cœur de la Cote","Cœur de la Cote",2019,4,null,"R105_P04",null,null,null,null,null,null,null,null,null,null,null,null,"HFE   ","Hirondelle de fenêtre","Oiseaux","Delichon urbicum                        "]
[105,"Cœur de la Cote","Cœur de la Cote",2019,5,null,"R105_P05",null,null,null,null,null,null,null,null,null,null,null,null,"HOB   ","Faucon hobereau","Oiseaux","Falco subbuteo                          "]
[105,"Cœur de la Cote","Cœur de la Cote",2019,6,null,"R105_P06",null,null,null,null,null,null,null,null,null,null,null,null,"HRI   ","Hirondelle de rivage","Oiseaux","Riparia riparia                         "]
[105,"Cœur de la Cote","Cœur de la Cote",2019,7,null,"R105_P07",null,null,null,null,null,null,null,null,null,null,null,null,"HRO   ","Hirondelle de rochers","Oiseaux","Ptyonoprogne rupestris                  "]
[105,"Cœur de la Cote","Cœur de la Cote",2019,8,null,"R105_P08",null,null,null,null,null,null,null,null,null,null,null,null,"HRU   ","Hirondelle rustique","Oiseaux","Hirundo rustica                         "]
[105,"Cœur de la Cote","Cœur de la Cote",2019,9,null,"R105_P09",null,null,null,null,null,null,null,null,null,null,null,null,"HUL   ","Chouette hulotte","Oiseaux","Strix aluco                             "]
[105,"Cœur de la Cote","Cœur de la Cote",2019,10,null,"R105_P10",null,null,null,null,null,null,null,null,null,null,null,null,"HUP   ","Huppe fasciée","Oiseaux","Upupa epops                             "]
[105,"Cœur de la Cote","Cœur de la Cote",2019,11,null,"R105_P11",null,null,null,null,null,null,null,null,null,null,null,null,"HYI   ","Hypolaïs ictérine","Oiseaux","Hippolais icterina                      "]
[105,"Cœur de la Cote","Cœur de la Cote",2019,12,null,"R105_P12",null,null,null,null,null,null,null,null,null,null,null,null,"HYP   ","Hypolaïs polyglotte","Oiseaux","Hippolais polyglotta                    "]
[96,"Corcelles-le-Jorat et environs","Corcelles-le-Jorat et environs",2019,1,3813,"R096_P01",null,null,null,null,null,null,null,null,null,null,null,null,"LAG   ","Lagopède alpin","Oiseaux","Lagopus muta                            "]
[96,"Corcelles-le-Jorat et environs","Corcelles-le-Jorat et environs",2019,2,3240,"R096_P02",null,null,null,null,null,null,null,null,null,null,null,null,"LIN   ","Linotte mélodieuse","Oiseaux","Carduelis cannabina                     "]
[96,"Corcelles-le-Jorat et environs","Corcelles-le-Jorat et environs",2019,3,3479,"R096_P03",null,null,null,null,null,null,null,null,null,null,null,null,"LOL   ","Locustelle luscinioïde","Oiseaux","Locustella luscinioides                 "]
[96,"Corcelles-le-Jorat et environs","Corcelles-le-Jorat et environs",2019,4,3908,"R096_P04",null,null,null,null,null,null,null,null,null,null,null,null,"LOR   ","Loriot d'Europe","Oiseaux","Oriolus oriolus                         "]
[86,"Creux du Van","Creux du Van",2018,1,4274,"R086_P01",null,null,null,null,null,null,null,null,null,null,null,null,"LOT   ","Locustelle tachetée","Oiseaux","Locustella naevia                       "]
[86,"Creux du Van","Creux du Van",2018,2,3681,"R086_P02",null,null,null,null,null,null,null,null,null,null,null,null,"LUS   ","Lusciniole à moustaches","Oiseaux","Acrocephalus melanopogon                "]
[86,"Creux du Van","Creux du Van",2018,3,4194,"R086_P03",null,null,null,null,null,null,null,null,null,null,null,null,"MAP   ","Marouette ponctuée","Oiseaux","Porzana porzana                         "]
[86,"Creux du Van","Creux du Van",2018,4,4666,"R086_P04",null,null,null,null,null,null,null,null,null,null,null,null,"MAR   ","Martinet noir","Oiseaux","Apus apus                               "]
[86,"Creux du Van","Creux du Van",2018,5,3792,"R086_P05",null,null,null,null,null,null,null,null,null,null,null,null,"MBL   ","Mésange bleue","Oiseaux","Cyanistes caeruleus"]
[43,"Curtilles","Curtilles",2018,1,4400,"R043_P01",null,null,null,null,null,null,null,null,null,null,null,null,"MBO   ","Mésange boréale (alpestre ou des saules)","Oiseaux","Poecile montanus"]
[43,"Curtilles","Curtilles",2018,2,3354,"R043_P02",null,null,null,null,null,null,null,null,null,null,null,null,"MCH   ","Mésange charbonnière","Oiseaux","Parus major                             "]
[43,"Curtilles","Curtilles",2018,3,3710,"R043_P03",null,null,null,null,null,null,null,null,null,null,null,null,"MDB   ","Marouette de Baillon","Oiseaux","Porzana pusilla                         "]
[43,"Curtilles","Curtilles",2018,4,4068,"R043_P04",null,null,null,null,null,null,null,null,null,null,null,null,"MDU   ","Hibou moyen-duc","Oiseaux","Asio otus                               "]
[43,"Curtilles","Curtilles",2018,5,4120,"R043_P05",null,null,null,null,null,null,null,null,null,null,null,null,"MEP   ","Merle à plastron","Oiseaux","Turdus torquatus                        "]
[43,"Curtilles","Curtilles",2018,6,4782,"R043_P06",null,null,null,null,null,null,null,null,null,null,null,null,"MER   ","Merle noir","Oiseaux","Turdus merula                           "]
[43,"Curtilles","Curtilles",2018,7,2716,"R043_P07",null,null,null,null,null,null,null,null,null,null,null,null,"MHU   ","Mésange huppée","Oiseaux","Lophophanes cristatus"]
[16,"Démoret Molondin","Démoret Molondin",2022,null,null,null,null,null,null,null,null,null,null,null,null,null,null,null,"MIN   ","Milan noir","Oiseaux","Milvus migrans                          "]
[24,"Donatyre Avenches","Donatyre Avenches",2016,1,3700,"R024_P01",null,null,null,null,null,null,null,null,null,null,null,null,"MIR   ","Milan royal","Oiseaux","Milvus milvus                           "]
[24,"Donatyre Avenches","Donatyre Avenches",2016,2,3662,"R024_P02",null,null,null,null,null,null,null,null,null,null,null,null,"MLQ   ","Mésange à longue queue","Oiseaux","Aegithalos caudatus                     "]
[24,"Donatyre Avenches","Donatyre Avenches",2016,3,3943,"R024_P03",null,null,null,null,null,null,null,null,null,null,null,null,"MNO   ","Mésange nonnette","Oiseaux","Poecile palustris"]
[93,"Faoug","Faoug",2019,1,5050,"R093_P01",null,null,null,null,null,null,null,null,null,null,null,null,"MNR   ","Mésange noire","Oiseaux","Periparus ater"]
[93,"Faoug","Faoug",2019,2,5400,"R093_P02",null,null,null,null,null,null,null,null,null,null,null,null,"MOB   ","Monticole bleu","Oiseaux","Monticola solitarius                    "]
[93,"Faoug","Faoug",2019,3,5490,"R093_P03",null,null,null,null,null,null,null,null,null,null,null,null,"MOC   ","Moineau cisalpin","Oiseaux","Passer italiae"]
[93,"Faoug","Faoug",2019,4,5160,"R093_P04",null,null,null,null,null,null,null,null,null,null,null,null,"MOD","Moineau domestique","Oiseaux","Passer domesticus                       "]
[80,"Fey Bercher Rueyres","Fey Bercher Rueyres",2018,1,4416,"R080_P01",null,null,null,null,null,null,null,null,null,null,null,null,"MOF   ","Moineau friquet","Oiseaux","Passer montanus                         "]
[80,"Fey Bercher Rueyres","Fey Bercher Rueyres",2018,2,4335,"R080_P02",null,null,null,null,null,null,null,null,null,null,null,null,"MOM   ","Mouette mélanocéphale","Oiseaux","Larus melanocephalus                    "]
[80,"Fey Bercher Rueyres","Fey Bercher Rueyres",2018,3,3788,"R080_P03",null,null,null,null,null,null,null,null,null,null,null,null,"MOR   ","Mouette rieuse","Oiseaux","Larus ridibundus                        "]
[26,"Frontière","Frontière",2016,1,4000,"R026_P01",null,null,null,null,null,null,null,null,null,null,null,null,"MOT   ","Traquet motteux","Oiseaux","Oenanthe oenanthe                       "]
[26,"Frontière","Frontière",2016,2,3268,"R026_P02",null,null,null,null,null,null,null,null,null,null,null,null,"MPA   ","Martinet pâle","Oiseaux","Apus pallidus                           "]
[26,"Frontière","Frontière",2016,3,3857,"R026_P03",null,null,null,null,null,null,null,null,null,null,null,null,"MPE   ","Martin-pêcheur d'Europe","Oiseaux","Alcedo atthis                           "]
[26,"Frontière","Frontière",2016,4,3680,"R026_P04",null,null,null,null,null,null,null,null,null,null,null,null,"MPO   ","Marouette poussin","Oiseaux","Porzana parva                           "]
[26,"Frontière","Frontière",2016,5,3900,"R026_P05",null,null,null,null,null,null,null,null,null,null,null,null,"MRO   ","Monticole de roche","Oiseaux","Monticola saxatilis                     "]
[26,"Frontière","Frontière",2016,6,4000,"R026_P06",null,null,null,null,null,null,null,null,null,null,null,null,"MVB   ","Martinet à ventre blanc","Oiseaux","Apus melba                              "]
[26,"Frontière","Frontière",2016,7,4700,"R026_P07",null,null,null,null,null,null,null,null,null,null,null,null,"NET   ","Nette rousse","Oiseaux","Netta rufina                            "]
[26,"Frontière","Frontière",2016,8,5100,"R026_P08",null,null,null,null,null,null,null,null,null,null,null,null,"NIV   ","Niverolle alpine","Oiseaux","Montifringilla nivalis                  "]
[26,"Frontière","Frontière",2016,9,4200,"R026_P09",null,null,null,null,null,null,null,null,null,null,null,null,"OIE   ","Oie cendrée","Oiseaux","Anser anser                             "]
[26,"Frontière","Frontière",2016,10,2985,"R026_P10",null,null,null,null,null,null,null,null,null,null,null,null,"OUE   ","Ouette d'Egypte","Oiseaux","Alopochen aegyptiaca                    "]
[26,"Frontière","Frontière",2016,11,4100,"R026_P11",null,null,null,null,null,null,null,null,null,null,null,null,"PAN   ","Panure à moustaches","Oiseaux","Panurus biarmicus                       "]
[26,"Frontière","Frontière",2016,12,3700,"R026_P12",null,null,null,null,null,null,null,null,null,null,null,null,"PBI   ","Pigeon biset domestique","Oiseaux","Columba livia domestica                 "]
[26,"Frontière","Frontière",2016,13,4000,"R026_P13",null,null,null,null,null,null,null,null,null,null,null,null,"PCE   ","Pic cendré","Oiseaux","Picus canus                             "]
[26,"Frontière","Frontière",2016,14,4000,"R026_P14",null,null,null,null,null,null,null,null,null,null,null,null,"PCO   ","Pigeon colombin","Oiseaux","Columba oenas                           "]
[5,"Grandcour_Chevroux","Grandcour_Chevroux",2018,1,5014,"R005_P01",null,null,null,null,null,null,null,null,null,null,null,null,"PDA   ","Pinson des arbres","Oiseaux","Fringilla coelebs                       "]
[5,"Grandcour_Chevroux","Grandcour_Chevroux",2018,2,4853,"R005_P02",null,null,null,null,null,null,null,null,null,null,null,null,"PDB   ","Pic à dos blanc","Oiseaux","Dendrocopos leucotos                    "]
[5,"Grandcour_Chevroux","Grandcour_Chevroux",2018,3,4255,"R005_P03",null,null,null,null,null,null,null,null,null,null,null,null,"PDU   ","Petit-duc scops","Oiseaux","Otus scops                              "]
[5,"Grandcour_Chevroux","Grandcour_Chevroux",2018,4,3835,"R005_P04",null,null,null,null,null,null,null,null,null,null,null,null,"PEB   ","Perdrix bartavelle","Oiseaux","Alectoris graeca                        "]
[5,"Grandcour_Chevroux","Grandcour_Chevroux",2018,5,4672,"R005_P05",null,null,null,null,null,null,null,null,null,null,null,null,"PEG   ","Perdrix grise","Oiseaux","Perdix perdix                           "]
[5,"Grandcour_Chevroux","Grandcour_Chevroux",2018,6,5367,"R005_P06",null,null,null,null,null,null,null,null,null,null,null,null,"PEL   ","Faucon pèlerin","Oiseaux","Falco peregrinus                        "]
[72,"Granges Sassel Menieres","Granges Sassel Menieres",2018,1,3156,"R072_P01",null,null,null,null,null,null,null,null,null,null,null,null,"PEP   ","Pic épeiche","Oiseaux","Dendrocopos major                       "]
[72,"Granges Sassel Menieres","Granges Sassel Menieres",2018,2,3113,"R072_P02",null,null,null,null,null,null,null,null,null,null,null,null,"PER   ","Perdrix rouge","Oiseaux","Alectoris rufa                          "]
[72,"Granges Sassel Menieres","Granges Sassel Menieres",2018,3,3711,"R072_P03",null,null,null,null,null,null,null,null,null,null,null,null,"PET   ","Pic épeichette","Oiseaux","Dendrocopos minor                       "]
[72,"Granges Sassel Menieres","Granges Sassel Menieres",2018,4,3534,"R072_P04",null,null,null,null,null,null,null,null,null,null,null,null,"PGE","Pie-grièche écorcheur","Oiseaux","Lanius collurio                         "]
[72,"Granges Sassel Menieres","Granges Sassel Menieres",2018,5,3449,"R072_P05",null,null,null,null,null,null,null,null,null,null,null,null,"PGG   ","Pie-grièche grise","Oiseaux","Lanius excubitor                        "]
[73,"Haut-Jorat","Haut-Jorat",2018,1,4579,"R073_P01",null,null,null,null,null,null,null,null,null,null,null,null,"PGP   ","Pie-grièche à poitrine rose","Oiseaux","Lanius minor                            "]
[73,"Haut-Jorat","Haut-Jorat",2018,2,3497,"R073_P02",null,null,null,null,null,null,null,null,null,null,null,null,"PGR   ","Petit Gravelot","Oiseaux","Charadrius dubius                       "]
[73,"Haut-Jorat","Haut-Jorat",2018,3,3159,"R073_P03",null,null,null,null,null,null,null,null,null,null,null,null,"PGT   ","Pie-grièche à tête rousse","Oiseaux","Lanius senator                          "]
[73,"Haut-Jorat","Haut-Jorat",2018,4,3525,"R073_P04",null,null,null,null,null,null,null,null,null,null,null,null,"PHR   ","Phragmite des joncs","Oiseaux","Acrocephalus schoenobaenus              "]
[73,"Haut-Jorat","Haut-Jorat",2018,5,3701,"R073_P05",null,null,null,null,null,null,null,null,null,null,null,null,"PIA   ","Pipit des arbres","Oiseaux","Anthus trivialis                        "]
[1,"Hauts de Moudon","Hauts de Moudon",2016,1,4214,"R001_P01",null,null,null,null,null,null,null,null,null,null,null,null,"PIE   ","Pie bavarde","Oiseaux","Pica pica                               "]
[1,"Hauts de Moudon","Hauts de Moudon",2016,2,4430,"R001_P02",null,null,null,null,null,null,null,null,null,null,null,null,"PIF   ","Pipit farlouse","Oiseaux","Anthus pratensis                        "]
[1,"Hauts de Moudon","Hauts de Moudon",2016,3,4542,"R001_P03",null,null,null,null,null,null,null,null,null,null,null,null,"PIL   ","Canard pilet","Oiseaux","Anas acuta                              "]
[1,"Hauts de Moudon","Hauts de Moudon",2016,4,5352,"R001_P04",null,null,null,null,null,null,null,null,null,null,null,null,"PIR   ","Pipit rousseline","Oiseaux","Anthus campestris                       "]
[45,"Henniez et environs","Henniez et environs",2018,1,4269,"R045_P01",null,null,null,null,null,null,null,null,null,null,null,null,"PIS   ","Pipit spioncelle","Oiseaux","Anthus spinoletta                       "]
[45,"Henniez et environs","Henniez et environs",2018,2,4207,"R045_P02",null,null,null,null,null,null,null,null,null,null,null,null,"PLU   ","Pluvier guignard","Oiseaux","Charadrius morinellus                   "]
[45,"Henniez et environs","Henniez et environs",2018,3,3876,"R045_P03",null,null,null,null,null,null,null,null,null,null,null,null,"PMA   ","Pic mar","Oiseaux","Dendrocopos medius                      "]
[45,"Henniez et environs","Henniez et environs",2018,4,3542,"R045_P04",null,null,null,null,null,null,null,null,null,null,null,null,"PNO   ","Pic noir","Oiseaux","Dryocopus martius                       "]
[45,"Henniez et environs","Henniez et environs",2018,5,4412,"R045_P05",null,null,null,null,null,null,null,null,null,null,null,null,"POB   ","Pouillot de Bonelli","Oiseaux","Phylloscopus bonelli                    "]
[45,"Henniez et environs","Henniez et environs",2018,6,4318,"R045_P06",null,null,null,null,null,null,null,null,null,null,null,null,"POF   ","Pouillot fitis","Oiseaux","Phylloscopus trochilus                  "]
[45,"Henniez et environs","Henniez et environs",2018,7,3403,"R045_P07",null,null,null,null,null,null,null,null,null,null,null,null,"POR   ","Pouillot verdâtre","Oiseaux","Phylloscopus trochiloides               "]
[45,"Henniez et environs","Henniez et environs",2018,8,4193,"R045_P08",null,null,null,null,null,null,null,null,null,null,null,null,"POS   ","Pouillot siffleur","Oiseaux","Phylloscopus sibilatrix                 "]
[98,"Lavaux-Jorat","Lavaux-Jorat",2019,1,3811,"R098_P01",null,null,null,null,null,null,null,null,null,null,null,null,"POV   ","Pouillot véloce","Oiseaux","Phylloscopus collybita                  "]
[98,"Lavaux-Jorat","Lavaux-Jorat",2019,2,3785,"R098_P02",null,null,null,null,null,null,null,null,null,null,null,null,"PRA   ","Pigeon ramier","Oiseaux","Columba palumbus                        "]
[98,"Lavaux-Jorat","Lavaux-Jorat",2019,3,3812,"R098_P03",null,null,null,null,null,null,null,null,null,null,null,null,"PTR   ","Pic tridactyle","Oiseaux","Picoides tridactylus                    "]
[98,"Lavaux-Jorat","Lavaux-Jorat",2019,4,4099,"R098_P04",null,null,null,null,null,null,null,null,null,null,null,null,"PVE   ","Pic vert","Oiseaux","Picus viridis                           "]
[98,"Lavaux-Jorat","Lavaux-Jorat",2019,5,3588,"R098_P05",null,null,null,null,null,null,null,null,null,null,null,null,"RAG   ","Râle des genêts","Oiseaux","Crex crex                               "]
[98,"Lavaux-Jorat","Lavaux-Jorat",2019,6,4037,"R098_P06",null,null,null,null,null,null,null,null,null,null,null,null,"RAL   ","Râle d'eau","Oiseaux","Rallus aquaticus                        "]
[98,"Lavaux-Jorat","Lavaux-Jorat",2019,7,3063,"R098_P07",null,null,null,null,null,null,null,null,null,null,null,null,"REF   ","Rousserolle effarvatte","Oiseaux","Acrocephalus scirpaceus                 "]
[98,"Lavaux-Jorat","Lavaux-Jorat",2019,8,3503,"R098_P08",null,null,null,null,null,null,null,null,null,null,null,null,"REM   ","Rémiz penduline","Oiseaux","Remiz pendulinus                        "]
[98,"Lavaux-Jorat","Lavaux-Jorat",2019,9,3333,"R098_P09",null,null,null,null,null,null,null,null,null,null,null,null,"RGO   ","Rougegorge familier","Oiseaux","Erithacus rubecula                      "]
[98,"Lavaux-Jorat","Lavaux-Jorat",2019,10,3940,"R098_P10",null,null,null,null,null,null,null,null,null,null,null,null,"RHU   ","Roitelet huppé","Oiseaux","Regulus regulus                         "]
[98,"Lavaux-Jorat","Lavaux-Jorat",2019,11,4010,"R098_P11",null,null,null,null,null,null,null,null,null,null,null,null,"ROC   ","Roselin cramoisi","Oiseaux","Carpodacus erythrinus                   "]
[98,"Lavaux-Jorat","Lavaux-Jorat",2019,12,3111,"R098_P12",null,null,null,null,null,null,null,null,null,null,null,null,"ROS   ","Rossignol philomèle","Oiseaux","Luscinia megarhynchos                   "]
[98,"Lavaux-Jorat","Lavaux-Jorat",2019,13,3842,"R098_P13",null,null,null,null,null,null,null,null,null,null,null,null,"RQF   ","Rougequeue à front blanc","Oiseaux","Phoenicurus phoenicurus                 "]
[98,"Lavaux-Jorat","Lavaux-Jorat",2019,14,3242,"R098_P14",null,null,null,null,null,null,null,null,null,null,null,null,"RQN   ","Rougequeue noir","Oiseaux","Phoenicurus ochruros                    "]
[98,"Lavaux-Jorat","Lavaux-Jorat",2019,15,3124,"R098_P15",null,null,null,null,null,null,null,null,null,null,null,null,"RTB   ","Roitelet à triple bandeau","Oiseaux","Regulus ignicapilla                     "]
[46,"Le Reculet","Le Reculet",2018,1,3443,"R046_P01",null,null,null,null,null,null,null,null,null,null,null,null,"RTU   ","Rousserolle turdoïde","Oiseaux","Acrocephalus arundinaceus               "]
[46,"Le Reculet","Le Reculet",2018,2,3270,"R046_P02",null,null,null,null,null,null,null,null,null,null,null,null,"RVE   ","Rousserolle verderolle","Oiseaux","Acrocephalus palustris                  "]
[46,"Le Reculet","Le Reculet",2018,3,4157,"R046_P03",null,null,null,null,null,null,null,null,null,null,null,null,"SAE   ","Sarcelle d'été","Oiseaux","Anas querquedula                        "]
[46,"Le Reculet","Le Reculet",2018,4,3825,"R046_P04",null,null,null,null,null,null,null,null,null,null,null,null,"SAH   ","Sarcelle d'hiver","Oiseaux","Anas crecca                             "]
[46,"Le Reculet","Le Reculet",2018,5,4472,"R046_P05",null,null,null,null,null,null,null,null,null,null,null,null,"SER   ","Serin cini","Oiseaux","Serinus serinus                         "]
[119,"Les Ormonts Leysin Corbeyrier","Les Ormonts Leysin Corbeyrier",2022,null,null,null,null,null,null,null,null,null,null,null,null,null,null,null,"SIT   ","Sittelle torchepot","Oiseaux","Sitta europaea                          "]
[44,"Les Vaux","Les Vaux",2018,1,3908,"R044_P01",null,null,null,null,null,null,null,null,null,null,null,null,"SIZ   ","Sizerin cabaret","Oiseaux","Carduelis cabaret                       "]
[44,"Les Vaux","Les Vaux",2018,2,4793,"R044_P02",null,null,null,null,null,null,null,null,null,null,null,null,"SOU   ","Canard souchet","Oiseaux","Anas clypeata                           "]
[44,"Les Vaux","Les Vaux",2018,3,4065,"R044_P03",null,null,null,null,null,null,null,null,null,null,null,null,"STA   ","Sterne arctique","Oiseaux","Sterna paradisaea                       "]
[44,"Les Vaux","Les Vaux",2018,4,3742,"R044_P04",null,null,null,null,null,null,null,null,null,null,null,null,"STE   ","Sterne pierregarin","Oiseaux","Sterna hirundo                          "]
[44,"Les Vaux","Les Vaux",2018,5,4571,"R044_P05",null,null,null,null,null,null,null,null,null,null,null,null,"TAB   ","Tadorne de Belon","Oiseaux","Tadorna tadorna                         "]
[44,"Les Vaux","Les Vaux",2018,6,3385,"R044_P06",null,null,null,null,null,null,null,null,null,null,null,null,"TAC   ","Tadorne casarca","Oiseaux","Tadorna ferruginea                      "]
[44,"Les Vaux","Les Vaux",2018,7,5324,"R044_P07",null,null,null,null,null,null,null,null,null,null,null,null,"TAR   ","Tarin des aulnes","Oiseaux","Carduelis spinus                        "]
[54,"Lièvre","Lièvre",2018,1,3676,"R054_P01",null,null,null,null,null,null,null,null,null,null,null,null,"TDP","Tarier des prés","Oiseaux","Saxicola rubetra                        "]
[54,"Lièvre","Lièvre",2018,2,4205,"R054_P02",null,null,null,null,null,null,null,null,null,null,null,null,"TEN   ","Chouette de Tengmalm","Oiseaux","Aegolius funereus                       "]
[54,"Lièvre","Lièvre",2018,3,4122,"R054_P03",null,null,null,null,null,null,null,null,null,null,null,null,"TET   ","Tétras lyre","Oiseaux","Tetrao tetrix                           "]
[54,"Lièvre","Lièvre",2018,4,3082,"R054_P04",null,null,null,null,null,null,null,null,null,null,null,null,"TIC   ","Tichodrome échelette","Oiseaux","Tichodroma muraria                      "]
[54,"Lièvre","Lièvre",2018,5,3746,"R054_P05",null,null,null,null,null,null,null,null,null,null,null,null,"TOB   ","Tourterelle des bois","Oiseaux","Streptopelia turtur                     "]
[54,"Lièvre","Lièvre",2018,6,3211,"R054_P06",null,null,null,null,null,null,null,null,null,null,null,null,"TOR","Torcol fourmilier","Oiseaux","Jynx torquilla                          "]
[54,"Lièvre","Lièvre",2018,7,3322,"R054_P07",null,null,null,null,null,null,null,null,null,null,null,null,"TOT   ","Tourterelle turque","Oiseaux","Streptopelia decaocto                   "]
[54,"Lièvre","Lièvre",2018,8,3791,"R054_P08",null,null,null,null,null,null,null,null,null,null,null,null,"TPA","Tarier pâtre","Oiseaux","Saxicola rubicola"]
[54,"Lièvre","Lièvre",2018,9,3848,"R054_P09",null,null,null,null,null,null,null,null,null,null,null,null,"TRO   ","Troglodyte mignon","Oiseaux","Troglodytes troglodytes                 "]
[54,"Lièvre","Lièvre",2018,10,4090,"R054_P10",null,null,null,null,null,null,null,null,null,null,null,null,"VAN   ","Vanneau huppé","Oiseaux","Vanellus vanellus                       "]
[54,"Lièvre","Lièvre",2018,11,3132,"R054_P11",null,null,null,null,null,null,null,null,null,null,null,null,"VEN   ","Venturon montagnard","Oiseaux","Serinus citrinella                      "]
[54,"Lièvre","Lièvre",2018,12,3842,"R054_P12",null,null,null,null,null,null,null,null,null,null,null,null,"VER   ","Verdier d'Europe","Oiseaux","Carduelis chloris                       "]
[54,"Lièvre","Lièvre",2018,13,4034,"R054_P13",null,null,null,null,null,null,null,null,null,null,null,null,null,"oiseaux supp","oiseaux supp","oiseaux supp"]
[54,"Lièvre","Lièvre",2018,14,3532,"R054_P14",null,null,null,null,null,null,null,null,null,null,null,null,null,"oiseaux supp","oiseaux supp","oiseaux supp"]
[54,"Lièvre","Lièvre",2018,15,3159,"R054_P15",null,null,null,null,null,null,null,null,null,null,null,null,null,"oiseaux supp","oiseaux supp","oiseaux supp"]
[85,"Mathod Suscévaz","Mathod Suscévaz",2018,1,4718,"R015_P01",null,null,null,null,null,null,null,null,null,null,null,null,null,"oiseaux supp","oiseaux supp","oiseaux supp"]
[85,"Mathod Suscévaz","Mathod Suscévaz",2018,2,4700,"R015_P02",null,null,null,null,null,null,null,null,null,null,null,null,null,"oiseaux supp","oiseaux supp","oiseaux supp"]
[85,"Mathod Suscévaz","Mathod Suscévaz",2018,3,6986,"R015_P03",null,null,null,null,null,null,null,null,null,null,null,null,null,"oiseaux supp","oiseaux supp","oiseaux supp"]
[15,"Merdasson","Merdasson",2022,null,null,null,null,null,null,null,null,null,null,null,null,null,null,null,null,"oiseaux supp","oiseaux supp","oiseaux supp"]
[22,"Missy","Missy",2016,1,5475,"R022_P01",null,null,null,null,null,null,null,null,null,null,null,null,null,"oiseaux supp","oiseaux supp","oiseaux supp"]
[22,"Missy","Missy",2016,2,3759,"R022_P02",null,null,null,null,null,null,null,null,null,null,null,null,null,"oiseaux supp","oiseaux supp","oiseaux supp"]
[22,"Missy","Missy",2016,3,4927,"R022_P03",null,null,null,null,null,null,null,null,null,null,null,null,null,"oiseaux supp","oiseaux supp","oiseaux supp"]
[22,"Missy","Missy",2016,4,4707,"R022_P04",null,null,null,null,null,null,null,null,null,null,null,null,null,"oiseaux supp","oiseaux supp","oiseaux supp"]
[38,"Les Monod","Les Monod",2019,1,3943,"R038_P01",null,null,null,null,null,null,null,null,null,null,null,null,null,"oiseaux supp","oiseaux supp","oiseaux supp"]
[38,"Les Monod","Les Monod",2019,2,3081,"R038_P02",null,null,null,null,null,null,null,null,null,null,null,null,null,"oiseaux supp","oiseaux supp","oiseaux supp"]
[38,"Les Monod","Les Monod",2019,3,3951,"R038_P03",null,null,null,null,null,null,null,null,null,null,null,null,null,"oiseaux supp","oiseaux supp","oiseaux supp"]
[38,"Les Monod","Les Monod",2019,4,3178,"R038_P04",null,null,null,null,null,null,null,null,null,null,null,null,null,"oiseaux supp","oiseaux supp","oiseaux supp"]
[38,"Les Monod","Les Monod",2019,5,3119,"R038_P05",null,null,null,null,null,null,null,null,null,null,null,null,null,"oiseaux supp","oiseaux supp","oiseaux supp"]
[38,"Les Monod","Les Monod",2019,6,3510,"R038_P06",null,null,null,null,null,null,null,null,null,null,null,null,null,"oiseaux supp","oiseaux supp","oiseaux supp"]
[38,"Les Monod","Les Monod",2019,7,3470,"R038_P07",null,null,null,null,null,null,null,null,null,null,null,null,null,"oiseaux supp","oiseaux supp","oiseaux supp"]
[38,"Les Monod","Les Monod",2019,8,3986,"R038_P08",null,null,null,null,null,null,null,null,null,null,null,null,null,"oiseaux supp","oiseaux supp","oiseaux supp"]
[38,"Les Monod","Les Monod",2019,9,3927,"R038_P09",null,null,null,null,null,null,null,null,null,null,null,null,null,"oiseaux supp","oiseaux supp","oiseaux supp"]
[38,"Les Monod","Les Monod",2019,10,3517,"R038_P10",null,null,null,null,null,null,null,null,null,null,null,null,null,"oiseaux supp","oiseaux supp","oiseaux supp"]
[38,"Les Monod","Les Monod",2019,11,4050,"R038_P11",null,null,null,null,null,null,null,null,null,null,null,null,null,"oiseaux supp","oiseaux supp","oiseaux supp"]
[38,"Les Monod","Les Monod",2019,12,3267,"R038_P12",null,null,null,null,null,null,null,null,null,null,null,null,null,"oiseaux supp","oiseaux supp","oiseaux supp"]
[38,"Les Monod","Les Monod",2019,13,4133,"R038_P13",null,null,null,null,null,null,null,null,null,null,null,null,null,"oiseaux supp","oiseaux supp","oiseaux supp"]
[4,"Montaubion-Chardonney","Montaubion-Chardonney",2017,1,4093,"R004_P01",null,null,null,null,null,null,null,null,null,null,null,null,null,"oiseaux supp","oiseaux supp","oiseaux supp"]
[4,"Montaubion-Chardonney","Montaubion-Chardonney",2017,2,3930,"R004_P02",null,null,null,null,null,null,null,null,null,null,null,null,null,"oiseaux supp","oiseaux supp","oiseaux supp"]
[52,"Montélaz","Montélaz",2018,1,4214,"R052_P01",null,null,null,null,null,null,null,null,null,null,null,null,null,"oiseaux supp","oiseaux supp","oiseaux supp"]
[52,"Montélaz","Montélaz",2018,2,4430,"R052_P02",null,null,null,null,null,null,null,null,null,null,null,null,null,"oiseaux supp","oiseaux supp","oiseaux supp"]
[52,"Montélaz","Montélaz",2018,3,4542,"R052_P03",null,null,null,null,null,null,null,null,null,null,null,null,null,"oiseaux supp","oiseaux supp","oiseaux supp"]
[52,"Montélaz","Montélaz",2018,4,5352,"R052_P04",null,null,null,null,null,null,null,null,null,null,null,null,null,"oiseaux supp","oiseaux supp","oiseaux supp"]
[97,"Mont-Pèlerin","Mont-Pèlerin",2019,1,3597,"R097_P01",null,null,null,null,null,null,null,null,null,null,null,null,null,"oiseaux supp","oiseaux supp","oiseaux supp"]
[97,"Mont-Pèlerin","Mont-Pèlerin",2019,2,3101,"R097_P02",null,null,null,null,null,null,null,null,null,null,null,null,null,"oiseaux supp","oiseaux supp","oiseaux supp"]
[97,"Mont-Pèlerin","Mont-Pèlerin",2019,3,3346,"R097_P03",null,null,null,null,null,null,null,null,null,null,null,null,null,"oiseaux supp","oiseaux supp","oiseaux supp"]
[97,"Mont-Pèlerin","Mont-Pèlerin",2019,4,4385,"R097_P04",null,null,null,null,null,null,null,null,null,null,null,null,null,"oiseaux supp","oiseaux supp","oiseaux supp"]
[97,"Mont-Pèlerin","Mont-Pèlerin",2019,5,3698,"R097_P05",null,null,null,null,null,null,null,null,null,null,null,null,null,"oiseaux supp","oiseaux supp","oiseaux supp"]
[97,"Mont-Pèlerin","Mont-Pèlerin",2019,6,3354,"R097_P06",null,null,null,null,null,null,null,null,null,null,null,null,null,"oiseaux supp","oiseaux supp","oiseaux supp"]
[97,"Mont-Pèlerin","Mont-Pèlerin",2019,7,3884,"R097_P07",null,null,null,null,null,null,null,null,null,null,null,null,null,"oiseaux supp","oiseaux supp","oiseaux supp"]
[104,"Muverans","Muverans",2019,1,3786,"R104_P01",null,null,null,null,null,null,null,null,null,null,null,null,null,"oiseaux supp","oiseaux supp","oiseaux supp"]
[104,"Muverans","Muverans",2019,2,3432,"R104_P02",null,null,null,null,null,null,null,null,null,null,null,null,null,"oiseaux supp","oiseaux supp","oiseaux supp"]
[104,"Muverans","Muverans",2019,3,3737,"R104_P03",null,null,null,null,null,null,null,null,null,null,null,null,null,"oiseaux supp","oiseaux supp","oiseaux supp"]
[104,"Muverans","Muverans",2019,4,3175,"R104_P04",null,null,null,null,null,null,null,null,null,null,null,null,null,"oiseaux supp","oiseaux supp","oiseaux supp"]
[104,"Muverans","Muverans",2019,5,4513,"R104_P05",null,null,null,null,null,null,null,null,null,null,null,null,null,"oiseaux supp","oiseaux supp","oiseaux supp"]
[104,"Muverans","Muverans",2019,6,4241,"R104_P06"]
[104,"Muverans","Muverans",2019,7,4261,"R104_P07"]
[30,"Nozon","Nozon",2017,1,4340,"R030_P01",null,null,null,null,null,null,null,null,null,null,null,null,null,"oiseaux supp","oiseaux supp","oiseaux supp"]
[30,"Nozon","Nozon",2017,2,4370,"R030_P02",null,null,null,null,null,null,null,null,null,null,null,null,null,"oiseaux supp","oiseaux supp","oiseaux supp"]
[30,"Nozon","Nozon",2017,3,3920,"R030_P03",null,null,null,null,null,null,null,null,null,null,null,null,null,"oiseaux supp","oiseaux supp","oiseaux supp"]
[30,"Nozon","Nozon",2017,4,4270,"R030_P04",null,null,null,null,null,null,null,null,null,null,null,null,null,"oiseaux supp","oiseaux supp","oiseaux supp"]
[30,"Nozon","Nozon",2017,5,4340,"R030_P05",null,null,null,null,null,null,null,null,null,null,null,null,null,"oiseaux supp","oiseaux supp","oiseaux supp"]
[30,"Nozon","Nozon",2017,6,3680,"R030_P06",null,null,null,null,null,null,null,null,null,null,null,null,null,"oiseaux supp","oiseaux supp","oiseaux supp"]
[51,"Nyon Région","Nyon Région",2018,2,null,"R051_P02",null,null,null,null,null,null,null,null,null,null,null,null,null,"oiseaux supp","oiseaux supp","oiseaux supp"]
[51,"Nyon Région","Nyon Région",2018,3,null,"R051_P03",null,null,null,null,null,null,null,null,null,null,null,null,null,"oiseaux supp","oiseaux supp","oiseaux supp"]
[51,"Nyon Région","Nyon Région",2018,4,null,"R051_P04",null,null,null,null,null,null,null,null,null,null,null,null,null,"oiseaux supp","oiseaux supp","oiseaux supp"]
[51,"Nyon Région","Nyon Région",2018,5,null,"R051_P05",null,null,null,null,null,null,null,null,null,null,null,null,null,"oiseaux supp","oiseaux supp","oiseaux supp"]
[51,"Nyon Région","Nyon Région",2018,6,null,"R051_P06",null,null,null,null,null,null,null,null,null,null,null,null,null,"oiseaux supp","oiseaux supp","oiseaux supp"]
[51,"Nyon Région","Nyon Région",2018,7,null,"R051_P07",null,null,null,null,null,null,null,null,null,null,null,null,null,"oiseaux supp","oiseaux supp","oiseaux supp"]
[51,"Nyon Région","Nyon Région",2018,8,null,"R051_P08",null,null,null,null,null,null,null,null,null,null,null,null,null,"oiseaux supp","oiseaux supp","oiseaux supp"]
[51,"Nyon Région","Nyon Région",2018,9,null,"R051_P09",null,null,null,null,null,null,null,null,null,null,null,null,null,"oiseaux supp","oiseaux supp","oiseaux supp"]
[51,"Nyon Région","Nyon Région",2018,"1A",null,"R051_P01A",null,null,null,null,null,null,null,null,null,null,null,null,null,"oiseaux supp","oiseaux supp","oiseaux supp"]
[51,"Nyon Région","Nyon Région",2018,"1B",null,"R051_P01B",null,null,null,null,null,null,null,null,null,null,null,null,null,"oiseaux supp","oiseaux supp","oiseaux supp"]
[34,"Onnens Bonvillars","Onnens Bonvillars",2017,1,3608,"R034_P01",null,null,null,null,null,null,null,null,null,null,null,null,null,"oiseaux supp","oiseaux supp","oiseaux supp"]
[34,"Onnens Bonvillars","Onnens Bonvillars",2017,2,3636,"R034_P02",null,null,null,null,null,null,null,null,null,null,null,null,null,"oiseaux supp","oiseaux supp","oiseaux supp"]
[34,"Onnens Bonvillars","Onnens Bonvillars",2017,3,3837,"R034_P03",null,null,null,null,null,null,null,null,null,null,null,null,null,"oiseaux supp","oiseaux supp","oiseaux supp"]
[34,"Onnens Bonvillars","Onnens Bonvillars",2017,4,3311,"R034_P04",null,null,null,null,null,null,null,null,null,null,null,null,null,"oiseaux supp","oiseaux supp","oiseaux supp"]
[77,"Oron","Oron",2018,1,3820,"R077_P01",null,null,null,null,null,null,null,null,null,null,null,null,null,"oiseaux supp","oiseaux supp","oiseaux supp"]
[77,"Oron","Oron",2018,2,3510,"R077_P02",null,null,null,null,null,null,null,null,null,null,null,null,null,"oiseaux supp","oiseaux supp","oiseaux supp"]
[77,"Oron","Oron",2018,3,3620,"R077_P03",null,null,null,null,null,null,null,null,null,null,null,null,null,"oiseaux supp","oiseaux supp","oiseaux supp"]
[77,"Oron","Oron",2018,4,4080,"R077_P04",null,null,null,null,null,null,null,null,null,null,null,null,null,"oiseaux supp","oiseaux supp","oiseaux supp"]
[77,"Oron","Oron",2018,5,3570,"R077_P05",null,null,null,null,null,null,null,null,null,null,null,null,null,"oiseaux supp","oiseaux supp","oiseaux supp"]
[77,"Oron","Oron",2018,6,4240,"R077_P06",null,null,null,null,null,null,null,null,null,null,null,null,null,"oiseaux supp","oiseaux supp","oiseaux supp"]
[77,"Oron","Oron",2018,7,4010,"R077_P07",null,null,null,null,null,null,null,null,null,null,null,null,null,"oiseaux supp","oiseaux supp","oiseaux supp"]
[77,"Oron","Oron",2018,8,4100,"R077_P08",null,null,null,null,null,null,null,null,null,null,null,null,null,"oiseaux supp","oiseaux supp","oiseaux supp"]
[115,"Payerne et environs","Payerne et environs",2022,null,null,null,null,null,null,null,null,null,null,null,null,null,null,null,null,"oiseaux supp","oiseaux supp","oiseaux supp"]
[28,"Pays d'Enhaut","Pays d'Enhaut",2016,1,3175,"R028_P01",null,null,null,null,null,null,null,null,null,null,null,null,null,"oiseaux supp","oiseaux supp","oiseaux supp"]
[28,"Pays d'Enhaut","Pays d'Enhaut",2016,2,3435,"R028_P02",null,null,null,null,null,null,null,null,null,null,null,null,null,"oiseaux supp","oiseaux supp","oiseaux supp"]
[28,"Pays d'Enhaut","Pays d'Enhaut",2016,3,null,"R028_P03",null,null,null,null,null,null,null,null,null,null,null,null,null,"oiseaux supp","oiseaux supp","oiseaux supp"]
[28,"Pays d'Enhaut","Pays d'Enhaut",2016,4,null,"R028_P04",null,null,null,null,null,null,null,null,null,null,null,null,null,"oiseaux supp","oiseaux supp","oiseaux supp"]
[28,"Pays d'Enhaut","Pays d'Enhaut",2016,5,2684,"R028_P05",null,null,null,null,null,null,null,null,null,null,null,null,null,"oiseaux supp","oiseaux supp","oiseaux supp"]
[28,"Pays d'Enhaut","Pays d'Enhaut",2016,6,null,"R028_P06",null,null,null,null,null,null,null,null,null,null,null,null,null,"oiseaux supp","oiseaux supp","oiseaux supp"]
[28,"Pays d'Enhaut","Pays d'Enhaut",2016,7,null,"R028_P07",null,null,null,null,null,null,null,null,null,null,null,null,null,"oiseaux supp","oiseaux supp","oiseaux supp"]
[28,"Pays d'Enhaut","Pays d'Enhaut",2016,8,3500,"R028_P08",null,null,null,null,null,null,null,null,null,null,null,null,null,"oiseaux supp","oiseaux supp","oiseaux supp"]
[28,"Pays d'Enhaut","Pays d'Enhaut",2016,9,null,"R028_P09",null,null,null,null,null,null,null,null,null,null,null,null,null,"oiseaux supp","oiseaux supp","oiseaux supp"]
[28,"Pays d'Enhaut","Pays d'Enhaut",2016,10,null,"R028_P10",null,null,null,null,null,null,null,null,null,null,null,null,null,"oiseaux supp","oiseaux supp","oiseaux supp"]
[28,"Pays d'Enhaut","Pays d'Enhaut",2016,11,null,"R028_P11",null,null,null,null,null,null,null,null,null,null,null,null,null,"oiseaux supp","oiseaux supp","oiseaux supp"]
[28,"Pays d'Enhaut","Pays d'Enhaut",2016,12,4100,"R028_P12",null,null,null,null,null,null,null,null,null,null,null,null,null,"oiseaux supp","oiseaux supp","oiseaux supp"]
[28,"Pays d'Enhaut","Pays d'Enhaut",2016,13,null,"R028_P13",null,null,null,null,null,null,null,null,null,null,null,null,null,"oiseaux supp","oiseaux supp","oiseaux supp"]
[28,"Pays d'Enhaut","Pays d'Enhaut",2016,14,null,"R028_P14",null,null,null,null,null,null,null,null,null,null,null,null,null,"oiseaux supp","oiseaux supp","oiseaux supp"]
[28,"Pays d'Enhaut","Pays d'Enhaut",2016,15,3900,"R028_P15",null,null,null,null,null,null,null,null,null,null,null,null,null,"oiseaux supp","oiseaux supp","oiseaux supp"]
[28,"Pays d'Enhaut","Pays d'Enhaut",2016,16,null,"R028_P16",null,null,null,null,null,null,null,null,null,null,null,null,null,"oiseaux supp","oiseaux supp","oiseaux supp"]
[28,"Pays d'Enhaut","Pays d'Enhaut",2016,17,4106,"R028_P17",null,null,null,null,null,null,null,null,null,null,null,null,null,"oiseaux supp","oiseaux supp","oiseaux supp"]
[28,"Pays d'Enhaut","Pays d'Enhaut",2016,18,null,"R028_P18",null,null,null,null,null,null,null,null,null,null,null,null,null,"oiseaux supp","oiseaux supp","oiseaux supp"]
[28,"Pays d'Enhaut","Pays d'Enhaut",2016,19,3444,"R028_P19",null,null,null,null,null,null,null,null,null,null,null,null,null,"oiseaux supp","oiseaux supp","oiseaux supp"]
[116,"Petit Flon","Petit Flon",2022,null,null,null,null,null,null,null,null,null,null,null,null,null,null,null,null,"oiseaux supp","oiseaux supp","oiseaux supp"]
[12,"Petite Glâne Vaudoise - Combremont","Petite Glâne Vaudoise",2019,1,4100,"R012_P01",null,null,null,null,null,null,null,null,null,null,null,null,null,"oiseaux supp","oiseaux supp","oiseaux supp"]
[12,"Petite Glâne Vaudoise - Combremont","Petite Glâne Vaudoise",2019,2,3057,"R012_P02",null,null,null,null,null,null,null,null,null,null,null,null,null,"oiseaux supp","oiseaux supp","oiseaux supp"]
[12,"Petite Glâne Vaudoise - Combremont","Petite Glâne Vaudoise",2019,3,3357,"R012_P03",null,null,null,null,null,null,null,null,null,null,null,null,null,"oiseaux supp","oiseaux supp","oiseaux supp"]
[12,"Petite Glâne Vaudoise - Combremont","Petite Glâne Vaudoise",2019,4,3253,"R012_P04",null,null,null,null,null,null,null,null,null,null,null,null,null,"oiseaux supp","oiseaux supp","oiseaux supp"]
[12,"Petite Glâne Vaudoise - Combremont","Petite Glâne Vaudoise",2019,5,4044,"R012_P05",null,null,null,null,null,null,null,null,null,null,null,null,null,"oiseaux supp","oiseaux supp","oiseaux supp"]
[31,"Pied du Jura","Pied du Jura",2017,1,3030,"R031_P01",null,null,null,null,null,null,null,null,null,null,null,null,null,"oiseaux supp","oiseaux supp","oiseaux supp"]
[31,"Pied du Jura","Pied du Jura",2017,2,4170,"R031_P02",null,null,null,null,null,null,null,null,null,null,null,null,null,"oiseaux supp","oiseaux supp","oiseaux supp"]
[31,"Pied du Jura","Pied du Jura",2017,3,4120,"R031_P03",null,null,null,null,null,null,null,null,null,null,null,null,null,"oiseaux supp","oiseaux supp","oiseaux supp"]
[31,"Pied du Jura","Pied du Jura",2017,4,4340,"R031_P04",null,null,null,null,null,null,null,null,null,null,null,null,null,"oiseaux supp","oiseaux supp","oiseaux supp"]
[31,"Pied du Jura","Pied du Jura",2017,5,4250,"R031_P05",null,null,null,null,null,null,null,null,null,null,null,null,null,"oiseaux supp","oiseaux supp","oiseaux supp"]
[31,"Pied du Jura","Pied du Jura",2017,6,4160,"R031_P06",null,null,null,null,null,null,null,null,null,null,null,null,null,"oiseaux supp","oiseaux supp","oiseaux supp"]
[118,"Plaine du Rhône Sud","Plaine du Rhône Sud",2022,null,null,null,null,null,null,null,null,null,null,null,null,null,null,null,null,"oiseaux supp","oiseaux supp","oiseaux supp"]
[95,"Pomy et environs","Pomy et environs",2019,1,3268,"R095_P01",null,null,null,null,null,null,null,null,null,null,null,null,null,"oiseaux supp","oiseaux supp","oiseaux supp"]
[95,"Pomy et environs","Pomy et environs",2019,2,3459,"R095_P02",null,null,null,null,null,null,null,null,null,null,null,null,null,"oiseaux supp","oiseaux supp","oiseaux supp"]
[95,"Pomy et environs","Pomy et environs",2019,3,4052,"R095_P03",null,null,null,null,null,null,null,null,null,null,null,null,null,"oiseaux supp","oiseaux supp","oiseaux supp"]
[95,"Pomy et environs","Pomy et environs",2019,4,3392,"R095_P04",null,null,null,null,null,null,null,null,null,null,null,null,null,"oiseaux supp","oiseaux supp","oiseaux supp"]
[3,"Puidoux","Puidoux",2016,1,3185,"R003_P01",null,null,null,null,null,null,null,null,null,null,null,null,null,"oiseaux supp","oiseaux supp","oiseaux supp"]
[3,"Puidoux","Puidoux",2016,2,3077,"R003_P02",null,null,null,null,null,null,null,null,null,null,null,null,null,"oiseaux supp","oiseaux supp","oiseaux supp"]
[3,"Puidoux","Puidoux",2016,3,3964,"R003_P03",null,null,null,null,null,null,null,null,null,null,null,null,null,"oiseaux supp","oiseaux supp","oiseaux supp"]
[3,"Puidoux","Puidoux",2016,4,3468,"R003_P04",null,null,null,null,null,null,null,null,null,null,null,null,null,"oiseaux supp","oiseaux supp","oiseaux supp"]
[94,"Rochers de Naye","Rochers de Naye",2019,1,3791,"R094_P01",null,null,null,null,null,null,null,null,null,null,null,null,null,"oiseaux supp","oiseaux supp","oiseaux supp"]
[94,"Rochers de Naye","Rochers de Naye",2019,2,2945,"R094_P02",null,null,null,null,null,null,null,null,null,null,null,null,null,"oiseaux supp","oiseaux supp","oiseaux supp"]
[94,"Rochers de Naye","Rochers de Naye",2019,3,3642,"R094_P03",null,null,null,null,null,null,null,null,null,null,null,null,null,"oiseaux supp","oiseaux supp","oiseaux supp"]
[94,"Rochers de Naye","Rochers de Naye",2019,4,4031,"R094_P04",null,null,null,null,null,null,null,null,null,null,null,null,null,"oiseaux supp","oiseaux supp","oiseaux supp"]
[94,"Rochers de Naye","Rochers de Naye",2019,5,3873,"R094_P05",null,null,null,null,null,null,null,null,null,null,null,null,null,"oiseaux supp","oiseaux supp","oiseaux supp"]
[94,"Rochers de Naye","Rochers de Naye",2019,6,3881,"R094_P06",null,null,null,null,null,null,null,null,null,null,null,null,null,"oiseaux supp","oiseaux supp","oiseaux supp"]
[94,"Rochers de Naye","Rochers de Naye",2019,7,3094,"R094_P07",null,null,null,null,null,null,null,null,null,null,null,null,null,"oiseaux supp","oiseaux supp","oiseaux supp"]
[94,"Rochers de Naye","Rochers de Naye",2019,8,4340,"R094_P08",null,null,null,null,null,null,null,null,null,null,null,null,null,"oiseaux supp","oiseaux supp","oiseaux supp"]
[102,"Saubrette","Saubrette",2019,1,3256,"R102_P01",null,null,null,null,null,null,null,null,null,null,null,null,null,"oiseaux supp","oiseaux supp","oiseaux supp"]
[102,"Saubrette","Saubrette",2019,2,3648,"R102_P02",null,null,null,null,null,null,null,null,null,null,null,null,null,"oiseaux supp","oiseaux supp","oiseaux supp"]
[102,"Saubrette","Saubrette",2019,3,3994,"R102_P03",null,null,null,null,null,null,null,null,null,null,null,null,null,"oiseaux supp","oiseaux supp","oiseaux supp"]
[50,"Serine","Serine",2018,1,3713,"R050_P01",null,null,null,null,null,null,null,null,null,null,null,null,null,"oiseaux supp","oiseaux supp","oiseaux supp"]
[50,"Serine","Serine",2018,2,3704,"R050_P02",null,null,null,null,null,null,null,null,null,null,null,null,null,"oiseaux supp","oiseaux supp","oiseaux supp"]
[50,"Serine","Serine",2018,3,3809,"R050_P03",null,null,null,null,null,null,null,null,null,null,null,null,null,"oiseaux supp","oiseaux supp","oiseaux supp"]
[50,"Serine","Serine",2018,4,3794,"R050_P04",null,null,null,null,null,null,null,null,null,null,null,null,null,"oiseaux supp","oiseaux supp","oiseaux supp"]
[50,"Serine","Serine",2018,5,3753,"R050_P05",null,null,null,null,null,null,null,null,null,null,null,null,null,"oiseaux supp","oiseaux supp","oiseaux supp"]
[114,"Ste-Croix","Ste-Croix",2022,null,null,null,null,null,null,null,null,null,null,null,null,null,null,null,null,"oiseaux supp","oiseaux supp","oiseaux supp"]
[25,"Syens","Syens",2016,1,null,"R025_P01",null,null,null,null,null,null,null,null,null,null,null,null,null,"oiseaux supp","oiseaux supp","oiseaux supp"]
[25,"Syens","Syens",2016,2,null,"R025_P02",null,null,null,null,null,null,null,null,null,null,null,null,null,"oiseaux supp","oiseaux supp","oiseaux supp"]
[25,"Syens","Syens",2016,3,4600,"R025_P03",null,null,null,null,null,null,null,null,null,null,null,null,null,"oiseaux supp","oiseaux supp","oiseaux supp"]
[25,"Syens","Syens",2016,4,null,"R025_P04",null,null,null,null,null,null,null,null,null,null,null,null,null,"oiseaux supp","oiseaux supp","oiseaux supp"]
[25,"Syens","Syens",2016,5,null,"R025_P05",null,null,null,null,null,null,null,null,null,null,null,null,null,"oiseaux supp","oiseaux supp","oiseaux supp"]
[14,"Terre Sainte","Terre Sainte",2022,null,null,null,null,null,null,null,null,null,null,null,null,null,null,null,null,"oiseaux supp","oiseaux supp","oiseaux supp"]
[103,"Tévenon","Tévenon",2019,1,2730,"R103_P01",null,null,null,null,null,null,null,null,null,null,null,null,null,"oiseaux supp","oiseaux supp","oiseaux supp"]
[103,"Tévenon","Tévenon",2019,2,3754,"R103_P02",null,null,null,null,null,null,null,null,null,null,null,null,null,"oiseaux supp","oiseaux supp","oiseaux supp"]
[103,"Tévenon","Tévenon",2019,3,4574,"R103_P03",null,null,null,null,null,null,null,null,null,null,null,null,null,"oiseaux supp","oiseaux supp","oiseaux supp"]
[42,"Tour Blanche","Tour Blanche",2018,1,3533,"R042_P01",null,null,null,null,null,null,null,null,null,null,null,null,null,"oiseaux supp","oiseaux supp","oiseaux supp"]
[42,"Tour Blanche","Tour Blanche",2018,2,4788,"R042_P02",null,null,null,null,null,null,null,null,null,null,null,null,null,"oiseaux supp","oiseaux supp","oiseaux supp"]
[42,"Tour Blanche","Tour Blanche",2018,3,4646,"R042_P03",null,null,null,null,null,null,null,null,null,null,null,null,null,"oiseaux supp","oiseaux supp","oiseaux supp"]
[42,"Tour Blanche","Tour Blanche",2018,4,5005,"R042_P04",null,null,null,null,null,null,null,null,null,null,null,null,null,"oiseaux supp","oiseaux supp","oiseaux supp"]
[58,"Trois Rivières","Trois Rivières",2018,1,3540,"R058_P01",null,null,null,null,null,null,null,null,null,null,null,null,null,"oiseaux supp","oiseaux supp","oiseaux supp"]
[58,"Trois Rivières","Trois Rivières",2018,2,3776,"R058_P02",null,null,null,null,null,null,null,null,null,null,null,null,null,"oiseaux supp","oiseaux supp","oiseaux supp"]
[58,"Trois Rivières","Trois Rivières",2018,3,4174,"R058_P03",null,null,null,null,null,null,null,null,null,null,null,null,null,"oiseaux supp","oiseaux supp","oiseaux supp"]
[58,"Trois Rivières","Trois Rivières",2018,4,4685,"R058_P04",null,null,null,null,null,null,null,null,null,null,null,null,null,"oiseaux supp","oiseaux supp","oiseaux supp"]
[58,"Trois Rivières","Trois Rivières",2018,5,4663,"R058_P05",null,null,null,null,null,null,null,null,null,null,null,null,null,"oiseaux supp","oiseaux supp","oiseaux supp"]
[58,"Trois Rivières","Trois Rivières",2018,6,4446,"R058_P06",null,null,null,null,null,null,null,null,null,null,null,null,null,"oiseaux supp","oiseaux supp","oiseaux supp"]
[58,"Trois Rivières","Trois Rivières",2018,7,4007,"R058_P07",null,null,null,null,null,null,null,null,null,null,null,null,null,"oiseaux supp","oiseaux supp","oiseaux supp"]
[58,"Trois Rivières","Trois Rivières",2018,8,4304,"R058_P08",null,null,null,null,null,null,null,null,null,null,null,null,null,"oiseaux supp","oiseaux supp","oiseaux supp"]
[58,"Trois Rivières","Trois Rivières",2018,9,3895,"R058_P09",null,null,null,null,null,null,null,null,null,null,null,null,null,"oiseaux supp","oiseaux supp","oiseaux supp"]
[58,"Trois Rivières","Trois Rivières",2018,10,3527,"R058_P10",null,null,null,null,null,null,null,null,null,null,null,null,null,"oiseaux supp","oiseaux supp","oiseaux supp"]
[58,"Trois Rivières","Trois Rivières",2018,11,3923,"R058_P11",null,null,null,null,null,null,null,null,null,null,null,null,null,"oiseaux supp","oiseaux supp","oiseaux supp"]
[58,"Trois Rivières","Trois Rivières",2018,12,3911,"R058_P12",null,null,null,null,null,null,null,null,null,null,null,null,null,"oiseaux supp","oiseaux supp","oiseaux supp"]
[58,"Trois Rivières","Trois Rivières",2018,13,4372,"R058_P13",null,null,null,null,null,null,null,null,null,null,null,null,null,"oiseaux supp","oiseaux supp","oiseaux supp"]
[58,"Trois Rivières","Trois Rivières",2018,14,3342,"R058_P14",null,null,null,null,null,null,null,null,null,null,null,null,null,"oiseaux supp","oiseaux supp","oiseaux supp"]
[58,"Trois Rivières","Trois Rivières",2018,15,3269,"R058_P15",null,null,null,null,null,null,null,null,null,null,null,null,null,"oiseaux supp","oiseaux supp","oiseaux supp"]
[58,"Trois Rivières","Trois Rivières",2018,16,4256,"R058_P16",null,null,null,null,null,null,null,null,null,null,null,null,null,"oiseaux supp","oiseaux supp","oiseaux supp"]
[58,"Trois Rivières","Trois Rivières",2018,17,4223,"R058_P17",null,null,null,null,null,null,null,null,null,null,null,null,null,"oiseaux supp","oiseaux supp","oiseaux supp"]
[58,"Trois Rivières","Trois Rivières",2018,18,3940,"R058_P18",null,null,null,null,null,null,null,null,null,null,null,null,null,"oiseaux supp","oiseaux supp","oiseaux supp"]
[58,"Trois Rivières","Trois Rivières",2018,19,4229,"R058_P19",null,null,null,null,null,null,null,null,null,null,null,null,null,"oiseaux supp","oiseaux supp","oiseaux supp"]
[58,"Trois Rivières","Trois Rivières",2018,20,4447,"R058_P20",null,null,null,null,null,null,null,null,null,null,null,null,null,"oiseaux supp","oiseaux supp","oiseaux supp"]
[58,"Trois Rivières","Trois Rivières",2018,21,3130,"R058_P21",null,null,null,null,null,null,null,null,null,null,null,null,null,"oiseaux supp","oiseaux supp","oiseaux supp"]
[58,"Trois Rivières","Trois Rivières",2018,22,4535,"R058_P22",null,null,null,null,null,null,null,null,null,null,null,null,null,"oiseaux supp","oiseaux supp","oiseaux supp"]
[58,"Trois Rivières","Trois Rivières",2018,23,4082,"R058_P23",null,null,null,null,null,null,null,null,null,null,null,null,null,"oiseaux supp","oiseaux supp","oiseaux supp"]
[75,"Valeyres-Sous-Rances","Valeyres-Sous-Rances",2018,1,3691,"R075_P01",null,null,null,null,null,null,null,null,null,null,null,null,null,"oiseaux supp","oiseaux supp","oiseaux supp"]
[75,"Valeyres-Sous-Rances","Valeyres-Sous-Rances",2018,2,3887,"R075_P02",null,null,null,null,null,null,null,null,null,null,null,null,null,"oiseaux supp","oiseaux supp","oiseaux supp"]
[75,"Valeyres-Sous-Rances","Valeyres-Sous-Rances",2018,3,3125,"R075_P03",null,null,null,null,null,null,null,null,null,null,null,null,null,"oiseaux supp","oiseaux supp","oiseaux supp"]
[75,"Valeyres-Sous-Rances","Valeyres-Sous-Rances",2018,4,3826,"R075_P04",null,null,null,null,null,null,null,null,null,null,null,null,null,"oiseaux supp","oiseaux supp","oiseaux supp"]
[108,"Vallée de Joux","Vallée de Joux",2019,1,3215,"R108_P01",null,null,null,null,null,null,null,null,null,null,null,null,null,"oiseaux supp","oiseaux supp","oiseaux supp"]
[108,"Vallée de Joux","Vallée de Joux",2019,2,3127,"R108_P02",null,null,null,null,null,null,null,null,null,null,null,null,null,"oiseaux supp","oiseaux supp","oiseaux supp"]
[108,"Vallée de Joux","Vallée de Joux",2019,3,3420,"R108_P03",null,null,null,null,null,null,null,null,null,null,null,null,null,"oiseaux supp","oiseaux supp","oiseaux supp"]
[108,"Vallée de Joux","Vallée de Joux",2019,4,3617,"R108_P04",null,null,null,null,null,null,null,null,null,null,null,null,null,"oiseaux supp","oiseaux supp","oiseaux supp"]
[108,"Vallée de Joux","Vallée de Joux",2019,5,3775,"R108_P05",null,null,null,null,null,null,null,null,null,null,null,null,null,"oiseaux supp","oiseaux supp","oiseaux supp"]
[108,"Vallée de Joux","Vallée de Joux",2019,6,4007,"R108_P06",null,null,null,null,null,null,null,null,null,null,null,null,null,"oiseaux supp","oiseaux supp","oiseaux supp"]
[108,"Vallée de Joux","Vallée de Joux",2019,7,3216,"R108_P07",null,null,null,null,null,null,null,null,null,null,null,null,null,"oiseaux supp","oiseaux supp","oiseaux supp"]
[108,"Vallée de Joux","Vallée de Joux",2019,8,4618,"R108_P08",null,null,null,null,null,null,null,null,null,null,null,null,null,"oiseaux supp","oiseaux supp","oiseaux supp"]
[36,"Vallon de la Greyle","Vallon de la Greyle",2017,1,4053,"R036_P01"]
[36,"Vallon de la Greyle","Vallon de la Greyle",2017,2,3902,"R036_P02"]
[36,"Vallon de la Greyle","Vallon de la Greyle",2017,3,3267,"R036_P03"]
[36,"Vallon de la Greyle","Vallon de la Greyle",2017,4,3700,"R036_P04"]
[18,"Vallorbe","Vallorbe",2023]
[107,"Venoge Mormont","Venoge Mormont",2019,1,3801,"R107_P01"]
[107,"Venoge Mormont","Venoge Mormont",2019,2,3486,"R107_P02"]
[107,"Venoge Mormont","Venoge Mormont",2019,3,3694,"R107_P03"]
[21,"Veyron-Venoge-Dizy","Veyron-Venoge-Dizy",2018,1,3600,"R021_P01"]
[21,"Veyron-Venoge-Dizy","Veyron-Venoge-Dizy",2018,2,3700,"R021_P02"]
[21,"Veyron-Venoge-Dizy","Veyron-Venoge-Dizy",2018,3,5000,"R021_P03"]
[21,"Veyron-Venoge-Dizy","Veyron-Venoge-Dizy",2018,4,3300,"R021_P04"]
[21,"Veyron-Venoge-Dizy","Veyron-Venoge-Dizy",2018,5,4200,"R021_P05"]
[21,"Veyron-Venoge-Dizy","Veyron-Venoge-Dizy",2018,6,3500,"R021_P06"]
[21,"Veyron-Venoge-Dizy","Veyron-Venoge-Dizy",2018,7,3400,"R021_P07"]
[21,"Veyron-Venoge-Dizy","Veyron-Venoge-Dizy",2018,8,3900,"R021_P08"]
[21,"Veyron-Venoge-Dizy","Veyron-Venoge-Dizy",2018,9,3200,"R021_P09"]
[21,"Veyron-Venoge-Dizy","Veyron-Venoge-Dizy",2018,10,3000,"R021_P10"]
[21,"Veyron-Venoge-Dizy","Veyron-Venoge-Dizy",2018,11,3100,"R021_P11"]
[21,"Veyron-Venoge-Dizy","Veyron-Venoge-Dizy",2018,12,3800,"R021_P12"]
[21,"Veyron-Venoge-Dizy","Veyron-Venoge-Dizy",2018,13,4100,"R021_P13"]
[39,"Villars-le-Terroir","Villars-le-Terroir",2017,1,3661,"R039_P01"]
[39,"Villars-le-Terroir","Villars-le-Terroir",2017,2,4711,"R039_P02"]
[39,"Villars-le-Terroir","Villars-le-Terroir",2017,3,3746,"R039_P03"]
[39,"Villars-le-Terroir","Villars-le-Terroir",2017,4,4593,"R039_P04"]
[39,"Villars-le-Terroir","Villars-le-Terroir",2017,5,4475,"R039_P05"]
[81,"Vully Diversité","Vully Diversité",2018,1,3870,"R081_P01"]
[81,"Vully Diversité","Vully Diversité",2018,2,3943,"R081_P02"]
[81,"Vully Diversité","Vully Diversité",2018,3,3628,"R081_P03"]
[81,"Vully Diversité","Vully Diversité",2018,4,3647,"R081_P04"]
[81,"Vully Diversité","Vully Diversité",2018,5,3226,"R081_P05"]
[81,"Vully Diversité","Vully Diversité",2018,6,3224,"R081_P06"]
[81,"Vully Diversité","Vully Diversité",2018,7,3829,"R081_P07"]
[81,"Vully Diversité","Vully Diversité",2018,8,3986,"R081_P08"]
[81,"Vully Diversité","Vully Diversité",2018,9,3920,"R081_P09"]
[81,"Vully Diversité","Vully Diversité",2018,10,3688,"R081_P10"]
["futur réseau","futur réseau","futur réseau","futur réseau","futur réseau","futur réseau","futur réseau"]
["futur réseau","futur réseau","futur réseau","futur réseau","futur réseau","futur réseau","futur réseau"]
["futur réseau","futur réseau","futur réseau","futur réseau","futur réseau","futur réseau","futur réseau"]
["futur réseau","futur réseau","futur réseau","futur réseau","futur réseau","futur réseau","futur réseau"]
["futur réseau","futur réseau","futur réseau","futur réseau","futur réseau","futur réseau","futur réseau"]
["futur réseau","futur réseau","futur réseau","futur réseau","futur réseau","futur réseau","futur réseau"]
["futur réseau","futur réseau","futur réseau","futur réseau","futur réseau","futur réseau","futur réseau"]
["futur réseau","futur réseau","futur réseau","futur réseau","futur réseau","futur réseau","futur réseau"]
["futur réseau","futur réseau","futur réseau","futur réseau","futur réseau","futur réseau","futur réseau"]
["futur réseau","futur réseau","futur réseau","futur réseau","futur réseau","futur réseau","futur réseau"]
["futur réseau","futur réseau","futur réseau","futur réseau","futur réseau","futur réseau","futur réseau"]
["futur réseau","futur réseau","futur réseau","futur réseau","futur réseau","futur réseau","futur réseau"]
["futur réseau","futur réseau","futur réseau","futur réseau","futur réseau","futur réseau","futur réseau"]
["futur réseau","futur réseau","futur réseau","futur réseau","futur réseau","futur réseau","futur réseau"]
["futur réseau","futur réseau","futur réseau","futur réseau","futur réseau","futur réseau","futur réseau"]
["futur réseau","futur réseau","futur réseau","futur réseau","futur réseau","futur réseau","futur réseau"]
["futur réseau","futur réseau","futur réseau","futur réseau","futur réseau","futur réseau","futur réseau"]
["futur réseau","futur réseau","futur réseau","futur réseau","futur réseau","futur réseau","futur réseau"]
["futur réseau","futur réseau","futur réseau","futur réseau","futur réseau","futur réseau","futur réseau"]
["futur réseau","futur réseau","futur réseau","futur réseau","futur réseau","futur réseau","futur réseau"]
["futur réseau","futur réseau","futur réseau","futur réseau","futur réseau","futur réseau","futur réseau"]
["futur réseau","futur réseau","futur réseau","futur réseau","futur réseau","futur réseau","futur réseau"]
["futur réseau","futur réseau","futur réseau","futur réseau","futur réseau","futur réseau","futur réseau"]
["futur réseau","futur réseau","futur réseau","futur réseau","futur réseau","futur réseau","futur réseau"]
["futur réseau","futur réseau","futur réseau","futur réseau","futur réseau","futur réseau","futur réseau"]
["futur réseau","futur réseau","futur réseau","futur réseau","futur réseau","futur réseau","futur réseau"]
["futur réseau","futur réseau","futur réseau","futur réseau","futur réseau","futur réseau","futur réseau"]
["futur réseau","futur réseau","futur réseau","futur réseau","futur réseau","futur réseau","futur réseau"]
["futur réseau","futur réseau","futur réseau","futur réseau","futur réseau","futur réseau","futur réseau"]
["futur réseau","futur réseau","futur réseau","futur réseau","futur réseau","futur réseau","futur réseau"]
["futur réseau","futur réseau","futur réseau","futur réseau","futur réseau","futur réseau","futur réseau"]
["futur réseau","futur réseau","futur réseau","futur réseau","futur réseau","futur réseau","futur réseau"]
["futur réseau","futur réseau","futur réseau","futur réseau","futur réseau","futur réseau","futur réseau"]
["futur réseau","futur réseau","futur réseau","futur réseau","futur réseau","futur réseau","futur réseau"]
["futur réseau","futur réseau","futur réseau","futur réseau","futur réseau","futur réseau","futur réseau"]
["futur réseau","futur réseau","futur réseau","futur réseau","futur réseau","futur réseau","futur réseau"]
["futur réseau","futur réseau","futur réseau","futur réseau","futur réseau","futur réseau","futur réseau"]
["futur réseau","futur réseau","futur réseau","futur réseau","futur réseau","futur réseau","futur réseau"]
["futur réseau","futur réseau","futur réseau","futur réseau","futur réseau","futur réseau","futur réseau"]
["futur réseau","futur réseau","futur réseau","futur réseau","futur réseau","futur réseau","futur réseau"]
["futur réseau","futur réseau","futur réseau","futur réseau","futur réseau","futur réseau","futur réseau"]
["futur réseau","futur réseau","futur réseau","futur réseau","futur réseau","futur réseau","futur réseau"]
["futur réseau","futur réseau","futur réseau","futur réseau","futur réseau","futur réseau","futur réseau"]
["futur réseau","futur réseau","futur réseau","futur réseau","futur réseau","futur réseau","futur réseau"]
["futur réseau","futur réseau","futur réseau","futur réseau","futur réseau","futur réseau","futur réseau"]
["futur réseau","futur réseau","futur réseau","futur réseau","futur réseau","futur réseau","futur réseau"]
["futur réseau","futur réseau","futur réseau","futur réseau","futur réseau","futur réseau","futur réseau"]
["futur réseau","futur réseau","futur réseau","futur réseau","futur réseau","futur réseau","futur réseau"]
["futur réseau","futur réseau","futur réseau","futur réseau","futur réseau","futur réseau","futur réseau"]
["futur réseau","futur réseau","futur réseau","futur réseau","futur réseau","futur réseau","futur réseau"]
["futur réseau","futur réseau","futur réseau","futur réseau","futur réseau","futur réseau","futur réseau"]
["futur réseau","futur réseau","futur réseau","futur réseau","futur réseau","futur réseau","futur réseau"]
["futur réseau","futur réseau","futur réseau","futur réseau","futur réseau","futur réseau","futur réseau"]
["futur réseau","futur réseau","futur réseau","futur réseau","futur réseau","futur réseau","futur réseau"]
["futur réseau","futur réseau","futur réseau","futur réseau","futur réseau","futur réseau","futur réseau"]
["futur réseau","futur réseau","futur réseau","futur réseau","futur réseau","futur réseau","futur réseau"]
["futur réseau","futur réseau","futur réseau","futur réseau","futur réseau","futur réseau","futur réseau"]
["futur réseau","futur réseau","futur réseau","futur réseau","futur réseau","futur réseau","futur réseau"]
["futur réseau","futur réseau","futur réseau","futur réseau","futur réseau","futur réseau","futur réseau"]
["futur réseau","futur réseau","futur réseau","futur réseau","futur réseau","futur réseau","futur réseau"]
["futur réseau","futur réseau","futur réseau","futur réseau","futur réseau","futur réseau","futur réseau"]
["futur réseau","futur réseau","futur réseau","futur réseau","futur réseau","futur réseau","futur réseau"]
["futur réseau","futur réseau","futur réseau","futur réseau","futur réseau","futur réseau","futur réseau"]
["futur réseau","futur réseau","futur réseau","futur réseau","futur réseau","futur réseau","futur réseau"]
["futur réseau","futur réseau","futur réseau","futur réseau","futur réseau","futur réseau","futur réseau"]
["futur réseau","futur réseau","futur réseau","futur réseau","futur réseau","futur réseau","futur réseau"]
["futur réseau","futur réseau","futur réseau","futur réseau","futur réseau","futur réseau","futur réseau"]
["futur réseau","futur réseau","futur réseau","futur réseau","futur réseau","futur réseau","futur réseau"]
["futur réseau","futur réseau","futur réseau","futur réseau","futur réseau","futur réseau","futur réseau"]
["futur réseau","futur réseau","futur réseau","futur réseau","futur réseau","futur réseau","futur réseau"]
["futur réseau","futur réseau","futur réseau","futur réseau","futur réseau","futur réseau","futur réseau"]
["futur réseau","futur réseau","futur réseau","futur réseau","futur réseau","futur réseau","futur réseau"]
["futur réseau","futur réseau","futur réseau","futur réseau","futur réseau","futur réseau","futur réseau"]
["futur réseau","futur réseau","futur réseau","futur réseau","futur réseau","futur réseau","futur réseau"]
["futur réseau","futur réseau","futur réseau","futur réseau","futur réseau","futur réseau","futur réseau"]
["futur réseau","futur réseau","futur réseau","futur réseau","futur réseau","futur réseau","futur réseau"]
["futur réseau","futur réseau","futur réseau","futur réseau","futur réseau","futur réseau","futur réseau"]
["futur réseau","futur réseau","futur réseau","futur réseau","futur réseau","futur réseau","futur réseau"]
["futur réseau","futur réseau","futur réseau","futur réseau","futur réseau","futur réseau","futur réseau"]
["futur réseau","futur réseau","futur réseau","futur réseau","futur réseau","futur réseau","futur réseau"]
["futur réseau","futur réseau","futur réseau","futur réseau","futur réseau","futur réseau","futur réseau"]
["futur réseau","futur réseau","futur réseau","futur réseau","futur réseau","futur réseau","futur réseau"]
["futur réseau","futur réseau","futur réseau","futur réseau","futur réseau","futur réseau","futur réseau"]
["futur réseau","futur réseau","futur réseau","futur réseau","futur réseau","futur réseau","futur réseau"]
["futur réseau","futur réseau","futur réseau","futur réseau","futur réseau","futur réseau","futur réseau"]
["futur réseau","futur réseau","futur réseau","futur réseau","futur réseau","futur réseau","futur réseau"]
["futur réseau","futur réseau","futur réseau","futur réseau","futur réseau","futur réseau","futur réseau"]
["futur réseau","futur réseau","futur réseau","futur réseau","futur réseau","futur réseau","futur réseau"]
["futur réseau","futur réseau","futur réseau","futur réseau","futur réseau","futur réseau","futur réseau"]
["futur réseau","futur réseau","futur réseau","futur réseau","futur réseau","futur réseau","futur réseau"]
["futur réseau","futur réseau","futur réseau","futur réseau","futur réseau","futur réseau","futur réseau"]
["futur réseau","futur réseau","futur réseau","futur réseau","futur réseau","futur réseau","futur réseau"]
["futur réseau","futur réseau","futur réseau","futur réseau","futur réseau","futur réseau","futur réseau"]
["futur réseau","futur réseau","futur réseau","futur réseau","futur réseau","futur réseau","futur réseau"]
["futur réseau","futur réseau","futur réseau","futur réseau","futur réseau","futur réseau","futur réseau"]
["futur réseau","futur réseau","futur réseau","futur réseau","futur réseau","futur réseau","futur réseau"]
["futur réseau","futur réseau","futur réseau","futur réseau","futur réseau","futur réseau","futur réseau"]
["futur réseau","futur réseau","futur réseau","futur réseau","futur réseau","futur réseau","futur réseau"]
["futur réseau","futur réseau","futur réseau","futur réseau","futur réseau","futur réseau","futur réseau"]
["futur réseau","futur réseau","futur réseau","futur réseau","futur réseau","futur réseau","futur réseau"]
["futur réseau","futur réseau","futur réseau","futur réseau","futur réseau","futur réseau","futur réseau"]
["futur réseau","futur réseau","futur réseau","futur réseau","futur réseau","futur réseau","futur réseau"]
["futur réseau","futur réseau","futur réseau","futur réseau","futur réseau","futur réseau","futur réseau"]
["futur réseau","futur réseau","futur réseau","futur réseau","futur réseau","futur réseau","futur réseau"]
["futur réseau","futur réseau","futur réseau","futur réseau","futur réseau","futur réseau","futur réseau"]
["futur réseau","futur réseau","futur réseau","futur réseau","futur réseau","futur réseau","futur réseau"]
["futur réseau","futur réseau","futur réseau","futur réseau","futur réseau","futur réseau","futur réseau"]
["futur réseau","futur réseau","futur réseau","futur réseau","futur réseau","futur réseau","futur réseau"]
["futur réseau","futur réseau","futur réseau","futur réseau","futur réseau","futur réseau","futur réseau"]
["futur réseau","futur réseau","futur réseau","futur réseau","futur réseau","futur réseau","futur réseau"]
["futur réseau","futur réseau","futur réseau","futur réseau","futur réseau","futur réseau","futur réseau"]
["futur réseau","futur réseau","futur réseau","futur réseau","futur réseau","futur réseau","futur réseau"]
["futur réseau","futur réseau","futur réseau","futur réseau","futur réseau","futur réseau","futur réseau"]
["futur réseau","futur réseau","futur réseau","futur réseau","futur réseau","futur réseau","futur réseau"]
["futur réseau","futur réseau","futur réseau","futur réseau","futur réseau","futur réseau","futur réseau"]
["futur réseau","futur réseau","futur réseau","futur réseau","futur réseau","futur réseau","futur réseau"]
["futur réseau","futur réseau","futur réseau","futur réseau","futur réseau","futur réseau","futur réseau"]
["futur réseau","futur réseau","futur réseau","futur réseau","futur réseau","futur réseau","futur réseau"]
["futur réseau","futur réseau","futur réseau","futur réseau","futur réseau","futur réseau","futur réseau"]
["futur réseau","futur réseau","futur réseau","futur réseau","futur réseau","futur réseau","futur réseau"]
["futur réseau","futur réseau","futur réseau","futur réseau","futur réseau","futur réseau","futur réseau"]
["futur réseau","futur réseau","futur réseau","futur réseau","futur réseau","futur réseau","futur réseau"]
["futur réseau","futur réseau","futur réseau","futur réseau","futur réseau","futur réseau","futur réseau"]
["futur réseau","futur réseau","futur réseau","futur réseau","futur réseau","futur réseau","futur réseau"]
["futur réseau","futur réseau","futur réseau","futur réseau","futur réseau","futur réseau","futur réseau"]
["futur réseau","futur réseau","futur réseau","futur réseau","futur réseau","futur réseau","futur réseau"]
["futur réseau","futur réseau","futur réseau","futur réseau","futur réseau","futur réseau","futur réseau"]
["futur réseau","futur réseau","futur réseau","futur réseau","futur réseau","futur réseau","futur réseau"]
["futur réseau","futur réseau","futur réseau","futur réseau","futur réseau","futur réseau","futur réseau"]
["futur réseau","futur réseau","futur réseau","futur réseau","futur réseau","futur réseau","futur réseau"]
["futur réseau","futur réseau","futur réseau","futur réseau","futur réseau","futur réseau","futur réseau"]
["futur réseau","futur réseau","futur réseau","futur réseau","futur réseau","futur réseau","futur réseau"]
["futur réseau","futur réseau","futur réseau","futur réseau","futur réseau","futur réseau","futur réseau"]
["futur réseau","futur réseau","futur réseau","futur réseau","futur réseau","futur réseau","futur réseau"]
["futur réseau","futur réseau","futur réseau","futur réseau","futur réseau","futur réseau","futur réseau"]
["futur réseau","futur réseau","futur réseau","futur réseau","futur réseau","futur réseau","futur réseau"]
["futur réseau","futur réseau","futur réseau","futur réseau","futur réseau","futur réseau","futur réseau"]
["futur réseau","futur réseau","futur réseau","futur réseau","futur réseau","futur réseau","futur réseau"]
["futur réseau","futur réseau","futur réseau","futur réseau","futur réseau","futur réseau","futur réseau"]
["futur réseau","futur réseau","futur réseau","futur réseau","futur réseau","futur réseau","futur réseau"]
["futur réseau","futur réseau","futur réseau","futur réseau","futur réseau","futur réseau","futur réseau"]
["futur réseau","futur réseau","futur réseau","futur réseau","futur réseau","futur réseau","futur réseau"]
["futur réseau","futur réseau","futur réseau","futur réseau","futur réseau","futur réseau","futur réseau"]
["futur réseau","futur réseau","futur réseau","futur réseau","futur réseau","futur réseau","futur réseau"]
["futur réseau","futur réseau","futur réseau","futur réseau","futur réseau","futur réseau","futur réseau"]
["futur réseau","futur réseau","futur réseau","futur réseau","futur réseau","futur réseau","futur réseau"]
["futur réseau","futur réseau","futur réseau","futur réseau","futur réseau","futur réseau","futur réseau"]
["futur réseau","futur réseau","futur réseau","futur réseau","futur réseau","futur réseau","futur réseau"]
["futur réseau","futur réseau","futur réseau","futur réseau","futur réseau","futur réseau","futur réseau"]
["futur réseau","futur réseau","futur réseau","futur réseau","futur réseau","futur réseau","futur réseau"]
["futur réseau","futur réseau","futur réseau","futur réseau","futur réseau","futur réseau","futur réseau"]
["futur réseau","futur réseau","futur réseau","futur réseau","futur réseau","futur réseau","futur réseau"]
["futur réseau","futur réseau","futur réseau","futur réseau","futur réseau","futur réseau","futur réseau"]
["futur réseau","futur réseau","futur réseau","futur réseau","futur réseau","futur réseau","futur réseau"]
["futur réseau","futur réseau","futur réseau","futur réseau","futur réseau","futur réseau","futur réseau"]
["futur réseau","futur réseau","futur réseau","futur réseau","futur réseau","futur réseau","futur réseau"]
["futur réseau","futur réseau","futur réseau","futur réseau","futur réseau","futur réseau","futur réseau"]
["futur réseau","futur réseau","futur réseau","futur réseau","futur réseau","futur réseau","futur réseau"]
["futur réseau","futur réseau","futur réseau","futur réseau","futur réseau","futur réseau","futur réseau"]
["futur réseau","futur réseau","futur réseau","futur réseau","futur réseau","futur réseau","futur réseau"]
["futur réseau","futur réseau","futur réseau","futur réseau","futur réseau","futur réseau","futur réseau"]
["futur réseau","futur réseau","futur réseau","futur réseau","futur réseau","futur réseau","futur réseau"]
["futur réseau","futur réseau","futur réseau","futur réseau","futur réseau","futur réseau","futur réseau"]
["futur réseau","futur réseau","futur réseau","futur réseau","futur réseau","futur réseau","futur réseau"]
["futur réseau","futur réseau","futur réseau","futur réseau","futur réseau","futur réseau","futur réseau"]
["futur réseau","futur réseau","futur réseau","futur réseau","futur réseau","futur réseau","futur réseau"]
["futur réseau","futur réseau","futur réseau","futur réseau","futur réseau","futur réseau","futur réseau"]
["futur réseau","futur réseau","futur réseau","futur réseau","futur réseau","futur réseau","futur réseau"]
["futur réseau","futur réseau","futur réseau","futur réseau","futur réseau","futur réseau","futur réseau"]
["futur réseau","futur réseau","futur réseau","futur réseau","futur réseau","futur réseau","futur réseau"]
["futur réseau","futur réseau","futur réseau","futur réseau","futur réseau","futur réseau","futur réseau"]
["futur réseau","futur réseau","futur réseau","futur réseau","futur réseau","futur réseau","futur réseau"]
["futur réseau","futur réseau","futur réseau","futur réseau","futur réseau","futur réseau","futur réseau"]
["futur réseau","futur réseau","futur réseau","futur réseau","futur réseau","futur réseau","futur réseau"]
["futur réseau","futur réseau","futur réseau","futur réseau","futur réseau","futur réseau","futur réseau"]
["futur réseau","futur réseau","futur réseau","futur réseau","futur réseau","futur réseau","futur réseau"]
["futur réseau","futur réseau","futur réseau","futur réseau","futur réseau","futur réseau","futur réseau"]
["futur réseau","futur réseau","futur réseau","futur réseau","futur réseau","futur réseau","futur réseau"]
["futur réseau","futur réseau","futur réseau","futur réseau","futur réseau","futur réseau","futur réseau"]
["futur réseau","futur réseau","futur réseau","futur réseau","futur réseau","futur réseau","futur réseau"]
["futur réseau","futur réseau","futur réseau","futur réseau","futur réseau","futur réseau","futur réseau"]
["futur réseau","futur réseau","futur réseau","futur réseau","futur réseau","futur réseau","futur réseau"]
["futur réseau","futur réseau","futur réseau","futur réseau","futur réseau","futur réseau","futur réseau"]
["futur réseau","futur réseau","futur réseau","futur réseau","futur réseau","futur réseau","futur réseau"]
["futur réseau","futur réseau","futur réseau","futur réseau","futur réseau","futur réseau","futur réseau"]
["futur réseau","futur réseau","futur réseau","futur réseau","futur réseau","futur réseau","futur réseau"]
["futur réseau","futur réseau","futur réseau","futur réseau","futur réseau","futur réseau","futur réseau"]
["futur réseau","futur réseau","futur réseau","futur réseau","futur réseau","futur réseau","futur réseau"]
["futur réseau","futur réseau","futur réseau","futur réseau","futur réseau","futur réseau","futur réseau"]
["futur réseau","futur réseau","futur réseau","futur réseau","futur réseau","futur réseau","futur réseau"]
["futur réseau","futur réseau","futur réseau","futur réseau","futur réseau","futur réseau","futur réseau"]
["futur réseau","futur réseau","futur réseau","futur réseau","futur réseau","futur réseau","futur réseau"]
["futur réseau","futur réseau","futur réseau","futur réseau","futur réseau","futur réseau","futur réseau"]
["futur réseau","futur réseau","futur réseau","futur réseau","futur réseau","futur réseau","futur réseau"]
["futur réseau","futur réseau","futur réseau","futur réseau","futur réseau","futur réseau","futur réseau"]
["futur réseau","futur réseau","futur réseau","futur réseau","futur réseau","futur réseau","futur réseau"]
["futur réseau","futur réseau","futur réseau","futur réseau","futur réseau","futur réseau","futur réseau"]
["futur réseau","futur réseau","futur réseau","futur réseau","futur réseau","futur réseau","futur réseau"]
["futur réseau","futur réseau","futur réseau","futur réseau","futur réseau","futur réseau","futur réseau"]
["futur réseau","futur réseau","futur réseau","futur réseau","futur réseau","futur réseau","futur réseau"]
["futur réseau","futur réseau","futur réseau","futur réseau","futur réseau","futur réseau","futur réseau"]
["futur réseau","futur réseau","futur réseau","futur réseau","futur réseau","futur réseau","futur réseau"]
["futur réseau","futur réseau","futur réseau","futur réseau","futur réseau","futur réseau","futur réseau"]
["futur réseau","futur réseau","futur réseau","futur réseau","futur réseau","futur réseau","futur réseau"]
["futur réseau","futur réseau","futur réseau","futur réseau","futur réseau","futur réseau","futur réseau"]
["futur réseau","futur réseau","futur réseau","futur réseau","futur réseau","futur réseau","futur réseau"]
["futur réseau","futur réseau","futur réseau","futur réseau","futur réseau","futur réseau","futur réseau"]
["futur réseau","futur réseau","futur réseau","futur réseau","futur réseau","futur réseau","futur réseau"]
["futur réseau","futur réseau","futur réseau","futur réseau","futur réseau","futur réseau","futur réseau"]
["futur réseau","futur réseau","futur réseau","futur réseau","futur réseau","futur réseau","futur réseau"]
["futur réseau","futur réseau","futur réseau","futur réseau","futur réseau","futur réseau","futur réseau"]
["futur réseau","futur réseau","futur réseau","futur réseau","futur réseau","futur réseau","futur réseau"]
["futur réseau","futur réseau","futur réseau","futur réseau","futur réseau","futur réseau","futur réseau"]
["futur réseau","futur réseau","futur réseau","futur réseau","futur réseau","futur réseau","futur réseau"]
["futur réseau","futur réseau","futur réseau","futur réseau","futur réseau","futur réseau","futur réseau"]
["futur réseau","futur réseau","futur réseau","futur réseau","futur réseau","futur réseau","futur réseau"]
["futur réseau","futur réseau","futur réseau","futur réseau","futur réseau","futur réseau","futur réseau"]
["futur réseau","futur réseau","futur réseau","futur réseau","futur réseau","futur réseau","futur réseau"]
["futur réseau","futur réseau","futur réseau","futur réseau","futur réseau","futur réseau","futur réseau"]
["futur réseau","futur réseau","futur réseau","futur réseau","futur réseau","futur réseau","futur réseau"]
["futur réseau","futur réseau","futur réseau","futur réseau","futur réseau","futur réseau","futur réseau"]
["futur réseau","futur réseau","futur réseau","futur réseau","futur réseau","futur réseau","futur réseau"]
["futur réseau","futur réseau","futur réseau","futur réseau","futur réseau","futur réseau","futur réseau"]
["futur réseau","futur réseau","futur réseau","futur réseau","futur réseau","futur réseau","futur réseau"]
["futur réseau","futur réseau","futur réseau","futur réseau","futur réseau","futur réseau","futur réseau"]
["futur réseau","futur réseau","futur réseau","futur réseau","futur réseau","futur réseau","futur réseau"]
["futur réseau","futur réseau","futur réseau","futur réseau","futur réseau","futur réseau","futur réseau"]
["futur réseau","futur réseau","futur réseau","futur réseau","futur réseau","futur réseau","futur réseau"]
["futur réseau","futur réseau","futur réseau","futur réseau","futur réseau","futur réseau","futur réseau"]
["futur réseau","futur réseau","futur réseau","futur réseau","futur réseau","futur réseau","futur réseau"]
["futur réseau","futur réseau","futur réseau","futur réseau","futur réseau","futur réseau","futur réseau"]
["futur réseau","futur réseau","futur réseau","futur réseau","futur réseau","futur réseau","futur réseau"]
["futur réseau","futur réseau","futur réseau","futur réseau","futur réseau","futur réseau","futur réseau"]
["futur réseau","futur réseau","futur réseau","futur réseau","futur réseau","futur réseau","futur réseau"]
["futur réseau","futur réseau","futur réseau","futur réseau","futur réseau","futur réseau","futur réseau"]
["futur réseau","futur réseau","futur réseau","futur réseau","futur réseau","futur réseau","futur réseau"]
["futur réseau","futur réseau","futur réseau","futur réseau","futur réseau","futur réseau","futur réseau"]
["futur réseau","futur réseau","futur réseau","futur réseau","futur réseau","futur réseau","futur réseau"]
["futur réseau","futur réseau","futur réseau","futur réseau","futur réseau","futur réseau","futur réseau"]
["futur réseau","futur réseau","futur réseau","futur réseau","futur réseau","futur réseau","futur réseau"]
["futur réseau","futur réseau","futur réseau","futur réseau","futur réseau","futur réseau","futur réseau"]
["futur réseau","futur réseau","futur réseau","futur réseau","futur réseau","futur réseau","futur réseau"]
["futur réseau","futur réseau","futur réseau","futur réseau","futur réseau","futur réseau","futur réseau"]
["futur réseau","futur réseau","futur réseau","futur réseau","futur réseau","futur réseau","futur réseau"]
["futur réseau","futur réseau","futur réseau","futur réseau","futur réseau","futur réseau","futur réseau"]
["futur réseau","futur réseau","futur réseau","futur réseau","futur réseau","futur réseau","futur réseau"]
["futur réseau","futur réseau","futur réseau","futur réseau","futur réseau","futur réseau","futur réseau"]
["futur réseau","futur réseau","futur réseau","futur réseau","futur réseau","futur réseau","futur réseau"]
["futur réseau","futur réseau","futur réseau","futur réseau","futur réseau","futur réseau","futur réseau"]
["futur réseau","futur réseau","futur réseau","futur réseau","futur réseau","futur réseau","futur réseau"]
["futur réseau","futur réseau","futur réseau","futur réseau","futur réseau","futur réseau","futur réseau"]
["futur réseau","futur réseau","futur réseau","futur réseau","futur réseau","futur réseau","futur réseau"]
["futur réseau","futur réseau","futur réseau","futur réseau","futur réseau","futur réseau","futur réseau"]
["futur réseau","futur réseau","futur réseau","futur réseau","futur réseau","futur réseau","futur réseau"]
["futur réseau","futur réseau","futur réseau","futur réseau","futur réseau","futur réseau","futur réseau"]
["futur réseau","futur réseau","futur réseau","futur réseau","futur réseau","futur réseau","futur réseau"]
["futur réseau","futur réseau","futur réseau","futur réseau","futur réseau","futur réseau","futur réseau"]
["futur réseau","futur réseau","futur réseau","futur réseau","futur réseau","futur réseau","futur réseau"]
["futur réseau","futur réseau","futur réseau","futur réseau","futur réseau","futur réseau","futur réseau"]
["futur réseau","futur réseau","futur réseau","futur réseau","futur réseau","futur réseau","futur réseau"]
["futur réseau","futur réseau","futur réseau","futur réseau","futur réseau","futur réseau","futur réseau"]
["futur réseau","futur réseau","futur réseau","futur réseau","futur réseau","futur réseau","futur réseau"]
["futur réseau","futur réseau","futur réseau","futur réseau","futur réseau","futur réseau","futur réseau"]
["futur réseau","futur réseau","futur réseau","futur réseau","futur réseau","futur réseau","futur réseau"]
["futur réseau","futur réseau","futur réseau","futur réseau","futur réseau","futur réseau","futur réseau"]
["futur réseau","futur réseau","futur réseau","futur réseau","futur réseau","futur réseau","futur réseau"]
["futur réseau","futur réseau","futur réseau","futur réseau","futur réseau","futur réseau","futur réseau"]
["futur réseau","futur réseau","futur réseau","futur réseau","futur réseau","futur réseau","futur réseau"]
["futur réseau","futur réseau","futur réseau","futur réseau","futur réseau","futur réseau","futur réseau"]
["futur réseau","futur réseau","futur réseau","futur réseau","futur réseau","futur réseau","futur réseau"]
["futur réseau","futur réseau","futur réseau","futur réseau","futur réseau","futur réseau","futur réseau"]
["futur réseau","futur réseau","futur réseau","futur réseau","futur réseau","futur réseau","futur réseau"]
["futur réseau","futur réseau","futur réseau","futur réseau","futur réseau","futur réseau","futur réseau"]
["futur réseau","futur réseau","futur réseau","futur réseau","futur réseau","futur réseau","futur réseau"]
["futur réseau","futur réseau","futur réseau","futur réseau","futur réseau","futur réseau","futur réseau"]
["futur réseau","futur réseau","futur réseau","futur réseau","futur réseau","futur réseau","futur réseau"]
["futur réseau","futur réseau","futur réseau","futur réseau","futur réseau","futur réseau","futur réseau"]
["futur réseau","futur réseau","futur réseau","futur réseau","futur réseau","futur réseau","futur réseau"]
["futur réseau","futur réseau","futur réseau","futur réseau","futur réseau","futur réseau","futur réseau"]
["futur réseau","futur réseau","futur réseau","futur réseau","futur réseau","futur réseau","futur réseau"]
["futur réseau","futur réseau","futur réseau","futur réseau","futur réseau","futur réseau","futur réseau"]
["futur réseau","futur réseau","futur réseau","futur réseau","futur réseau","futur réseau","futur réseau"]
["futur réseau","futur réseau","futur réseau","futur réseau","futur réseau","futur réseau","futur réseau"]
["futur réseau","futur réseau","futur réseau","futur réseau","futur réseau","futur réseau","futur réseau"]
["futur réseau","futur réseau","futur réseau","futur réseau","futur réseau","futur réseau","futur réseau"]
["futur réseau","futur réseau","futur réseau","futur réseau","futur réseau","futur réseau","futur réseau"]
["futur réseau","futur réseau","futur réseau","futur réseau","futur réseau","futur réseau","futur réseau"]
["futur réseau","futur réseau","futur réseau","futur réseau","futur réseau","futur réseau","futur réseau"]
["futur réseau","futur réseau","futur réseau","futur réseau","futur réseau","futur réseau","futur réseau"]
["futur réseau","futur réseau","futur réseau","futur réseau","futur réseau","futur réseau","futur réseau"]
["futur réseau","futur réseau","futur réseau","futur réseau","futur réseau","futur réseau","futur réseau"]
["futur réseau","futur réseau","futur réseau","futur réseau","futur réseau","futur réseau","futur réseau"]
["futur réseau","futur réseau","futur réseau","futur réseau","futur réseau","futur réseau","futur réseau"]
["futur réseau","futur réseau","futur réseau","futur réseau","futur réseau","futur réseau","futur réseau"]
["futur réseau","futur réseau","futur réseau","futur réseau","futur réseau","futur réseau","futur réseau"]
["futur réseau","futur réseau","futur réseau","futur réseau","futur réseau","futur réseau","futur réseau"]
["futur réseau","futur réseau","futur réseau","futur réseau","futur réseau","futur réseau","futur réseau"]
["futur réseau","futur réseau","futur réseau","futur réseau","futur réseau","futur réseau","futur réseau"]
["futur réseau","futur réseau","futur réseau","futur réseau","futur réseau","futur réseau","futur réseau"]
["futur réseau","futur réseau","futur réseau","futur réseau","futur réseau","futur réseau","futur réseau"]
["futur réseau","futur réseau","futur réseau","futur réseau","futur réseau","futur réseau","futur réseau"]
["futur réseau","futur réseau","futur réseau","futur réseau","futur réseau","futur réseau","futur réseau"]
["futur réseau","futur réseau","futur réseau","futur réseau","futur réseau","futur réseau","futur réseau"]
["futur réseau","futur réseau","futur réseau","futur réseau","futur réseau","futur réseau","futur réseau"]
["futur réseau","futur réseau","futur réseau","futur réseau","futur réseau","futur réseau","futur réseau"]
["futur réseau","futur réseau","futur réseau","futur réseau","futur réseau","futur réseau","futur réseau"]
["futur réseau","futur réseau","futur réseau","futur réseau","futur réseau","futur réseau","futur réseau"]
["futur réseau","futur réseau","futur réseau","futur réseau","futur réseau","futur réseau","futur réseau"]
["futur réseau","futur réseau","futur réseau","futur réseau","futur réseau","futur réseau","futur réseau"]
["futur réseau","futur réseau","futur réseau","futur réseau","futur réseau","futur réseau","futur réseau"]
["futur réseau","futur réseau","futur réseau","futur réseau","futur réseau","futur réseau","futur réseau"]
["futur réseau","futur réseau","futur réseau","futur réseau","futur réseau","futur réseau","futur réseau"]
["futur réseau","futur réseau","futur réseau","futur réseau","futur réseau","futur réseau","futur réseau"]
["futur réseau","futur réseau","futur réseau","futur réseau","futur réseau","futur réseau","futur réseau"]
["futur réseau","futur réseau","futur réseau","futur réseau","futur réseau","futur réseau","futur réseau"]
["futur réseau","futur réseau","futur réseau","futur réseau","futur réseau","futur réseau","futur réseau"]
["futur réseau","futur réseau","futur réseau","futur réseau","futur réseau","futur réseau","futur réseau"]
["futur réseau","futur réseau","futur réseau","futur réseau","futur réseau","futur réseau","futur réseau"]
["futur réseau","futur réseau","futur réseau","futur réseau","futur réseau","futur réseau","futur réseau"]
["futur réseau","futur réseau","futur réseau","futur réseau","futur réseau","futur réseau","futur réseau"]
["futur réseau","futur réseau","futur réseau","futur réseau","futur réseau","futur réseau","futur réseau"]
["futur réseau","futur réseau","futur réseau","futur réseau","futur réseau","futur réseau","futur réseau"]
["futur réseau","futur réseau","futur réseau","futur réseau","futur réseau","futur réseau","futur réseau"]
["futur réseau","futur réseau","futur réseau","futur réseau","futur réseau","futur réseau","futur réseau"]
["futur réseau","futur réseau","futur réseau","futur réseau","futur réseau","futur réseau","futur réseau"]
["futur réseau","futur réseau","futur réseau","futur réseau","futur réseau","futur réseau","futur réseau"]
["futur réseau","futur réseau","futur réseau","futur réseau","futur réseau","futur réseau","futur réseau"]
["futur réseau","futur réseau","futur réseau","futur réseau","futur réseau","futur réseau","futur réseau"]
["futur réseau","futur réseau","futur réseau","futur réseau","futur réseau","futur réseau","futur réseau"]
["futur réseau","futur réseau","futur réseau","futur réseau","futur réseau","futur réseau","futur réseau"]
["futur réseau","futur réseau","futur réseau","futur réseau","futur réseau","futur réseau","futur réseau"]
["futur réseau","futur réseau","futur réseau","futur réseau","futur réseau","futur réseau","futur réseau"]
["futur réseau","futur réseau","futur réseau","futur réseau","futur réseau","futur réseau","futur réseau"]
["futur réseau","futur réseau","futur réseau","futur réseau","futur réseau","futur réseau","futur réseau"]
["futur réseau","futur réseau","futur réseau","futur réseau","futur réseau","futur réseau","futur réseau"]
["futur réseau","futur réseau","futur réseau","futur réseau","futur réseau","futur réseau","futur réseau"]
["futur réseau","futur réseau","futur réseau","futur réseau","futur réseau","futur réseau","futur réseau"]
["futur réseau","futur réseau","futur réseau","futur réseau","futur réseau","futur réseau","futur réseau"]
["futur réseau","futur réseau","futur réseau","futur réseau","futur réseau","futur réseau","futur réseau"]
["futur réseau","futur réseau","futur réseau","futur réseau","futur réseau","futur réseau","futur réseau"]
["futur réseau","futur réseau","futur réseau","futur réseau","futur réseau","futur réseau","futur réseau"]
["futur réseau","futur réseau","futur réseau","futur réseau","futur réseau","futur réseau","futur réseau"]
["futur réseau","futur réseau","futur réseau","futur réseau","futur réseau","futur réseau","futur réseau"]
["futur réseau","futur réseau","futur réseau","futur réseau","futur réseau","futur réseau","futur réseau"]
["futur réseau","futur réseau","futur réseau","futur réseau","futur réseau","futur réseau","futur réseau"]
["futur réseau","futur réseau","futur réseau","futur réseau","futur réseau","futur réseau","futur réseau"]
["futur réseau","futur réseau","futur réseau","futur réseau","futur réseau","futur réseau","futur réseau"]
["futur réseau","futur réseau","futur réseau","futur réseau","futur réseau","futur réseau","futur réseau"]
["futur réseau","futur réseau","futur réseau","futur réseau","futur réseau","futur réseau","futur réseau"]
["futur réseau","futur réseau","futur réseau","futur réseau","futur réseau","futur réseau","futur réseau"]
["futur réseau","futur réseau","futur réseau","futur réseau","futur réseau","futur réseau","futur réseau"]
["futur réseau","futur réseau","futur réseau","futur réseau","futur réseau","futur réseau","futur réseau"]
["futur réseau","futur réseau","futur réseau","futur réseau","futur réseau","futur réseau","futur réseau"]
["futur réseau","futur réseau","futur réseau","futur réseau","futur réseau","futur réseau","futur réseau"]
["futur réseau","futur réseau","futur réseau","futur réseau","futur réseau","futur réseau","futur réseau"]
["futur réseau","futur réseau","futur réseau","futur réseau","futur réseau","futur réseau","futur réseau"]
["futur réseau","futur réseau","futur réseau","futur réseau","futur réseau","futur réseau","futur réseau"]
["futur réseau","futur réseau","futur réseau","futur réseau","futur réseau","futur réseau","futur réseau"]
["futur réseau","futur réseau","futur réseau","futur réseau","futur réseau","futur réseau","futur réseau"]
["futur réseau","futur réseau","futur réseau","futur réseau","futur réseau","futur réseau","futur réseau"]
["futur réseau","futur réseau","futur réseau","futur réseau","futur réseau","futur réseau","futur réseau"]
["futur réseau","futur réseau","futur réseau","futur réseau","futur réseau","futur réseau","futur réseau"]
["futur réseau","futur réseau","futur réseau","futur réseau","futur réseau","futur réseau","futur réseau"]
["futur réseau","futur réseau","futur réseau","futur réseau","futur réseau","futur réseau","futur réseau"]
["futur réseau","futur réseau","futur réseau","futur réseau","futur réseau","futur réseau","futur réseau"]
["futur réseau","futur réseau","futur réseau","futur réseau","futur réseau","futur réseau","futur réseau"]
["futur réseau","futur réseau","futur réseau","futur réseau","futur réseau","futur réseau","futur réseau"]
["futur réseau","futur réseau","futur réseau","futur réseau","futur réseau","futur réseau","futur réseau"]
["futur réseau","futur réseau","futur réseau","futur réseau","futur réseau","futur réseau","futur réseau"]
["futur réseau","futur réseau","futur réseau","futur réseau","futur réseau","futur réseau","futur réseau"]
["futur réseau","futur réseau","futur réseau","futur réseau","futur réseau","futur réseau","futur réseau"]
["futur réseau","futur réseau","futur réseau","futur réseau","futur réseau","futur réseau","futur réseau"]
["futur réseau","futur réseau","futur réseau","futur réseau","futur réseau","futur réseau","futur réseau"]
["futur réseau","futur réseau","futur réseau","futur réseau","futur réseau","futur réseau","futur réseau"]
["futur réseau","futur réseau","futur réseau","futur réseau","futur réseau","futur réseau","futur réseau"]
["futur réseau","futur réseau","futur réseau","futur réseau","futur réseau","futur réseau","futur réseau"]
["futur réseau","futur réseau","futur réseau","futur réseau","futur réseau","futur réseau","futur réseau"]
["futur réseau","futur réseau","futur réseau","futur réseau","futur réseau","futur réseau","futur réseau"]
["futur réseau","futur réseau","futur réseau","futur réseau","futur réseau","futur réseau","futur réseau"]
["futur réseau","futur réseau","futur réseau","futur réseau","futur réseau","futur réseau","futur réseau"]
["futur réseau","futur réseau","futur réseau","futur réseau","futur réseau","futur réseau","futur réseau"]
["futur réseau","futur réseau","futur réseau","futur réseau","futur réseau","futur réseau","futur réseau"]
["futur réseau","futur réseau","futur réseau","futur réseau","futur réseau","futur réseau","futur réseau"]
["futur réseau","futur réseau","futur réseau","futur réseau","futur réseau","futur réseau","futur réseau"]
["futur réseau","futur réseau","futur réseau","futur réseau","futur réseau","futur réseau","futur réseau"]
["futur réseau","futur réseau","futur réseau","futur réseau","futur réseau","futur réseau","futur réseau"]
["futur réseau","futur réseau","futur réseau","futur réseau","futur réseau","futur réseau","futur réseau"]
["futur réseau","futur réseau","futur réseau","futur réseau","futur réseau","futur réseau","futur réseau"]
["futur réseau","futur réseau","futur réseau","futur réseau","futur réseau","futur réseau","futur réseau"]
["futur réseau","futur réseau","futur réseau","futur réseau","futur réseau","futur réseau","futur réseau"]
["futur réseau","futur réseau","futur réseau","futur réseau","futur réseau","futur réseau","futur réseau"]
["futur réseau","futur réseau","futur réseau","futur réseau","futur réseau","futur réseau","futur réseau"]
["futur réseau","futur réseau","futur réseau","futur réseau","futur réseau","futur réseau","futur réseau"]
["futur réseau","futur réseau","futur réseau","futur réseau","futur réseau","futur réseau","futur réseau"]
["futur réseau","futur réseau","futur réseau","futur réseau","futur réseau","futur réseau","futur réseau"]
["futur réseau","futur réseau","futur réseau","futur réseau","futur réseau","futur réseau","futur réseau"]
["futur réseau","futur réseau","futur réseau","futur réseau","futur réseau","futur réseau","futur réseau"]
["futur réseau","futur réseau","futur réseau","futur réseau","futur réseau","futur réseau","futur réseau"]
["futur réseau","futur réseau","futur réseau","futur réseau","futur réseau","futur réseau","futur réseau"]
["futur réseau","futur réseau","futur réseau","futur réseau","futur réseau","futur réseau","futur réseau"]
["futur réseau","futur réseau","futur réseau","futur réseau","futur réseau","futur réseau","futur réseau"]
["futur réseau","futur réseau","futur réseau","futur réseau","futur réseau","futur réseau","futur réseau"]
["futur réseau","futur réseau","futur réseau","futur réseau","futur réseau","futur réseau","futur réseau"]
["futur réseau","futur réseau","futur réseau","futur réseau","futur réseau","futur réseau","futur réseau"]
["futur réseau","futur réseau","futur réseau","futur réseau","futur réseau","futur réseau","futur réseau"]
["futur réseau","futur réseau","futur réseau","futur réseau","futur réseau","futur réseau","futur réseau"]
["futur réseau","futur réseau","futur réseau","futur réseau","futur réseau","futur réseau","futur réseau"]
["futur réseau","futur réseau","futur réseau","futur réseau","futur réseau","futur réseau","futur réseau"]
["futur réseau","futur réseau","futur réseau","futur réseau","futur réseau","futur réseau","futur réseau"]
["futur réseau","futur réseau","futur réseau","futur réseau","futur réseau","futur réseau","futur réseau"]
["futur réseau","futur réseau","futur réseau","futur réseau","futur réseau","futur réseau","futur réseau"]
["futur réseau","futur réseau","futur réseau","futur réseau","futur réseau","futur réseau","futur réseau"]
["futur réseau","futur réseau","futur réseau","futur réseau","futur réseau","futur réseau","futur réseau"]
["futur réseau","futur réseau","futur réseau","futur réseau","futur réseau","futur réseau","futur réseau"]
["futur réseau","futur réseau","futur réseau","futur réseau","futur réseau","futur réseau","futur réseau"]
["futur réseau","futur réseau","futur réseau","futur réseau","futur réseau","futur réseau","futur réseau"]
["futur réseau","futur réseau","futur réseau","futur réseau","futur réseau","futur réseau","futur réseau"]
["futur réseau","futur réseau","futur réseau","futur réseau","futur réseau","futur réseau","futur réseau"]
["futur réseau","futur réseau","futur réseau","futur réseau","futur réseau","futur réseau","futur réseau"]
["futur réseau","futur réseau","futur réseau","futur réseau","futur réseau","futur réseau","futur réseau"]
["futur réseau","futur réseau","futur réseau","futur réseau","futur réseau","futur réseau","futur réseau"]
["futur réseau","futur réseau","futur réseau","futur réseau","futur réseau","futur réseau","futur réseau"]
["futur réseau","futur réseau","futur réseau","futur réseau","futur réseau","futur réseau","futur réseau"]
["futur réseau","futur réseau","futur réseau","futur réseau","futur réseau","futur réseau","futur réseau"]
["futur réseau","futur réseau","futur réseau","futur réseau","futur réseau","futur réseau","futur réseau"]
["futur réseau","futur réseau","futur réseau","futur réseau","futur réseau","futur réseau","futur réseau"]
["futur réseau","futur réseau","futur réseau","futur réseau","futur réseau","futur réseau","futur réseau"]
["futur réseau","futur réseau","futur réseau","futur réseau","futur réseau","futur réseau","futur réseau"]
["futur réseau","futur réseau","futur réseau","futur réseau","futur réseau","futur réseau","futur réseau"]
["futur réseau","futur réseau","futur réseau","futur réseau","futur réseau","futur réseau","futur réseau"]
["futur réseau","futur réseau","futur réseau","futur réseau","futur réseau","futur réseau","futur réseau"]
["futur réseau","futur réseau","futur réseau","futur réseau","futur réseau","futur réseau","futur réseau"]
["futur réseau","futur réseau","futur réseau","futur réseau","futur réseau","futur réseau","futur réseau"]
["futur réseau","futur réseau","futur réseau","futur réseau","futur réseau","futur réseau","futur réseau"]
["futur réseau","futur réseau","futur réseau","futur réseau","futur réseau","futur réseau","futur réseau"]
["futur réseau","futur réseau","futur réseau","futur réseau","futur réseau","futur réseau","futur réseau"]
["futur réseau","futur réseau","futur réseau","futur réseau","futur réseau","futur réseau","futur réseau"]
["futur réseau","futur réseau","futur réseau","futur réseau","futur réseau","futur réseau","futur réseau"]
["futur réseau","futur réseau","futur réseau","futur réseau","futur réseau","futur réseau","futur réseau"]
["futur réseau","futur réseau","futur réseau","futur réseau","futur réseau","futur réseau","futur réseau"]
["futur réseau","futur réseau","futur réseau","futur réseau","futur réseau","futur réseau","futur réseau"]
["futur réseau","futur réseau","futur réseau","futur réseau","futur réseau","futur réseau","futur réseau"]
["futur réseau","futur réseau","futur réseau","futur réseau","futur réseau","futur réseau","futur réseau"]
["futur réseau","futur réseau","futur réseau","futur réseau","futur réseau","futur réseau","futur réseau"]
["futur réseau","futur réseau","futur réseau","futur réseau","futur réseau","futur réseau","futur réseau"]
["futur réseau","futur réseau","futur réseau","futur réseau","futur réseau","futur réseau","futur réseau"]
["futur réseau","futur réseau","futur réseau","futur réseau","futur réseau","futur réseau","futur réseau"]
["futur réseau","futur réseau","futur réseau","futur réseau","futur réseau","futur réseau","futur réseau"]
["futur réseau","futur réseau","futur réseau","futur réseau","futur réseau","futur réseau","futur réseau"]
["futur réseau","futur réseau","futur réseau","futur réseau","futur réseau","futur réseau","futur réseau"]
["futur réseau","futur réseau","futur réseau","futur réseau","futur réseau","futur réseau","futur réseau"]
["futur réseau","futur réseau","futur réseau","futur réseau","futur réseau","futur réseau","futur réseau"]
["futur réseau","futur réseau","futur réseau","futur réseau","futur réseau","futur réseau","futur réseau"]
["futur réseau","futur réseau","futur réseau","futur réseau","futur réseau","futur réseau","futur réseau"]
["futur réseau","futur réseau","futur réseau","futur réseau","futur réseau","futur réseau","futur réseau"]
["futur réseau","futur réseau","futur réseau","futur réseau","futur réseau","futur réseau","futur réseau"]
["futur réseau","futur réseau","futur réseau","futur réseau","futur réseau","futur réseau","futur réseau"]
["futur réseau","futur réseau","futur réseau","futur réseau","futur réseau","futur réseau","futur réseau"]
["futur réseau","futur réseau","futur réseau","futur réseau","futur réseau","futur réseau","futur réseau"]
["futur réseau","futur réseau","futur réseau","futur réseau","futur réseau","futur réseau","futur réseau"]
["futur réseau","futur réseau","futur réseau","futur réseau","futur réseau","futur réseau","futur réseau"]
["futur réseau","futur réseau","futur réseau","futur réseau","futur réseau","futur réseau","futur réseau"]
["futur réseau","futur réseau","futur réseau","futur réseau","futur réseau","futur réseau","futur réseau"]
["futur réseau","futur réseau","futur réseau","futur réseau","futur réseau","futur réseau","futur réseau"]
["futur réseau","futur réseau","futur réseau","futur réseau","futur réseau","futur réseau","futur réseau"]
["futur réseau","futur réseau","futur réseau","futur réseau","futur réseau","futur réseau","futur réseau"]
["futur réseau","futur réseau","futur réseau","futur réseau","futur réseau","futur réseau","futur réseau"]
["futur réseau","futur réseau","futur réseau","futur réseau","futur réseau","futur réseau","futur réseau"]
["futur réseau","futur réseau","futur réseau","futur réseau","futur réseau","futur réseau","futur réseau"]
["futur réseau","futur réseau","futur réseau","futur réseau","futur réseau","futur réseau","futur réseau"]
["futur réseau","futur réseau","futur réseau","futur réseau","futur réseau","futur réseau","futur réseau"]
["futur réseau","futur réseau","futur réseau","futur réseau","futur réseau","futur réseau","futur réseau"]
["futur réseau","futur réseau","futur réseau","futur réseau","futur réseau","futur réseau","futur réseau"]
["futur réseau","futur réseau","futur réseau","futur réseau","futur réseau","futur réseau","futur réseau"]
["futur réseau","futur réseau","futur réseau","futur réseau","futur réseau","futur réseau","futur réseau"]
["futur réseau","futur réseau","futur réseau","futur réseau","futur réseau","futur réseau","futur réseau"]
["futur réseau","futur réseau","futur réseau","futur réseau","futur réseau","futur réseau","futur réseau"]
["futur réseau","futur réseau","futur réseau","futur réseau","futur réseau","futur réseau","futur réseau"]
["futur réseau","futur réseau","futur réseau","futur réseau","futur réseau","futur réseau","futur réseau"]
["futur réseau","futur réseau","futur réseau","futur réseau","futur réseau","futur réseau","futur réseau"]
["futur réseau","futur réseau","futur réseau","futur réseau","futur réseau","futur réseau","futur réseau"]
["futur réseau","futur réseau","futur réseau","futur réseau","futur réseau","futur réseau","futur réseau"]
["futur réseau","futur réseau","futur réseau","futur réseau","futur réseau","futur réseau","futur réseau"]
["futur réseau","futur réseau","futur réseau","futur réseau","futur réseau","futur réseau","futur réseau"]
["futur réseau","futur réseau","futur réseau","futur réseau","futur réseau","futur réseau","futur réseau"]
["futur réseau","futur réseau","futur réseau","futur réseau","futur réseau","futur réseau","futur réseau"]
["futur réseau","futur réseau","futur réseau","futur réseau","futur réseau","futur réseau","futur réseau"]
["futur réseau","futur réseau","futur réseau","futur réseau","futur réseau","futur réseau","futur réseau"]
["futur réseau","futur réseau","futur réseau","futur réseau","futur réseau","futur réseau","futur réseau"]
["futur réseau","futur réseau","futur réseau","futur réseau","futur réseau","futur réseau","futur réseau"]
["futur réseau","futur réseau","futur réseau","futur réseau","futur réseau","futur réseau","futur réseau"]
["futur réseau","futur réseau","futur réseau","futur réseau","futur réseau","futur réseau","futur réseau"]
["futur réseau","futur réseau","futur réseau","futur réseau","futur réseau","futur réseau","futur réseau"]
["futur réseau","futur réseau","futur réseau","futur réseau","futur réseau","futur réseau","futur réseau"]
["futur réseau","futur réseau","futur réseau","futur réseau","futur réseau","futur réseau","futur réseau"]
["futur réseau","futur réseau","futur réseau","futur réseau","futur réseau","futur réseau","futur réseau"]
["futur réseau","futur réseau","futur réseau","futur réseau","futur réseau","futur réseau","futur réseau"]
["futur réseau","futur réseau","futur réseau","futur réseau","futur réseau","futur réseau","futur réseau"]
["futur réseau","futur réseau","futur réseau","futur réseau","futur réseau","futur réseau","futur réseau"]
["futur réseau","futur réseau","futur réseau","futur réseau","futur réseau","futur réseau","futur réseau"]
["futur réseau","futur réseau","futur réseau","futur réseau","futur réseau","futur réseau","futur réseau"]
["futur réseau","futur réseau","futur réseau","futur réseau","futur réseau","futur réseau","futur réseau"]
["futur réseau","futur réseau","futur réseau","futur réseau","futur réseau","futur réseau","futur réseau"]
["futur réseau","futur réseau","futur réseau","futur réseau","futur réseau","futur réseau","futur réseau"]
["futur réseau","futur réseau","futur réseau","futur réseau","futur réseau","futur réseau","futur réseau"]
["futur réseau","futur réseau","futur réseau","futur réseau","futur réseau","futur réseau","futur réseau"]
["futur réseau","futur réseau","futur réseau","futur réseau","futur réseau","futur réseau","futur réseau"]
["futur réseau","futur réseau","futur réseau","futur réseau","futur réseau","futur réseau","futur réseau"]
["futur réseau","futur réseau","futur réseau","futur réseau","futur réseau","futur réseau","futur réseau"]
["futur réseau","futur réseau","futur réseau","futur réseau","futur réseau","futur réseau","futur réseau"]
["futur réseau","futur réseau","futur réseau","futur réseau","futur réseau","futur réseau","futur réseau"]
["futur réseau","futur réseau","futur réseau","futur réseau","futur réseau","futur réseau","futur réseau"]
["futur réseau","futur réseau","futur réseau","futur réseau","futur réseau","futur réseau","futur réseau"]
["futur réseau","futur réseau","futur réseau","futur réseau","futur réseau","futur réseau","futur réseau"]
["futur réseau","futur réseau","futur réseau","futur réseau","futur réseau","futur réseau","futur réseau"]
["futur réseau","futur réseau","futur réseau","futur réseau","futur réseau","futur réseau","futur réseau"]
["futur réseau","futur réseau","futur réseau","futur réseau","futur réseau","futur réseau","futur réseau"]
["futur réseau","futur réseau","futur réseau","futur réseau","futur réseau","futur réseau","futur réseau"]
["futur réseau","futur réseau","futur réseau","futur réseau","futur réseau","futur réseau","futur réseau"]
["futur réseau","futur réseau","futur réseau","futur réseau","futur réseau","futur réseau","futur réseau"]
["futur réseau","futur réseau","futur réseau","futur réseau","futur réseau","futur réseau","futur réseau"]
["futur réseau","futur réseau","futur réseau","futur réseau","futur réseau","futur réseau","futur réseau"]
["futur réseau","futur réseau","futur réseau","futur réseau","futur réseau","futur réseau","futur réseau"]
["futur réseau","futur réseau","futur réseau","futur réseau","futur réseau","futur réseau","futur réseau"]
["futur réseau","futur réseau","futur réseau","futur réseau","futur réseau","futur réseau","futur réseau"]
["futur réseau","futur réseau","futur réseau","futur réseau","futur réseau","futur réseau","futur réseau"]
["futur réseau","futur réseau","futur réseau","futur réseau","futur réseau","futur réseau","futur réseau"]
["futur réseau","futur réseau","futur réseau","futur réseau","futur réseau","futur réseau","futur réseau"]
["futur réseau","futur réseau","futur réseau","futur réseau","futur réseau","futur réseau","futur réseau"]
["futur réseau","futur réseau","futur réseau","futur réseau","futur réseau","futur réseau","futur réseau"]
["futur réseau","futur réseau","futur réseau","futur réseau","futur réseau","futur réseau","futur réseau"]
["futur réseau","futur réseau","futur réseau","futur réseau","futur réseau","futur réseau","futur réseau"]
["futur réseau","futur réseau","futur réseau","futur réseau","futur réseau","futur réseau","futur réseau"]
["futur réseau","futur réseau","futur réseau","futur réseau","futur réseau","futur réseau","futur réseau"]
["futur réseau","futur réseau","futur réseau","futur réseau","futur réseau","futur réseau","futur réseau"]
["futur réseau","futur réseau","futur réseau","futur réseau","futur réseau","futur réseau","futur réseau"]
["futur réseau","futur réseau","futur réseau","futur réseau","futur réseau","futur réseau","futur réseau"]
["futur réseau","futur réseau","futur réseau","futur réseau","futur réseau","futur réseau","futur réseau"]
["futur réseau","futur réseau","futur réseau","futur réseau","futur réseau","futur réseau","futur réseau"]
["futur réseau","futur réseau","futur réseau","futur réseau","futur réseau","futur réseau","futur réseau"]
["futur réseau","futur réseau","futur réseau","futur réseau","futur réseau","futur réseau","futur réseau"]
["futur réseau","futur réseau","futur réseau","futur réseau","futur réseau","futur réseau","futur réseau"]
["futur réseau","futur réseau","futur réseau","futur réseau","futur réseau","futur réseau","futur réseau"]
["futur réseau","futur réseau","futur réseau","futur réseau","futur réseau","futur réseau","futur réseau"]
["futur réseau","futur réseau","futur réseau","futur réseau","futur réseau","futur réseau","futur réseau"]
["futur réseau","futur réseau","futur réseau","futur réseau","futur réseau","futur réseau","futur réseau"]
["futur réseau","futur réseau","futur réseau","futur réseau","futur réseau","futur réseau","futur réseau"]
["futur réseau","futur réseau","futur réseau","futur réseau","futur réseau","futur réseau","futur réseau"]
["futur réseau","futur réseau","futur réseau","futur réseau","futur réseau","futur réseau","futur réseau"]
["futur réseau","futur réseau","futur réseau","futur réseau","futur réseau","futur réseau","futur réseau"]
["futur réseau","futur réseau","futur réseau","futur réseau","futur réseau","futur réseau","futur réseau"]
["futur réseau","futur réseau","futur réseau","futur réseau","futur réseau","futur réseau","futur réseau"]
["futur réseau","futur réseau","futur réseau","futur réseau","futur réseau","futur réseau","futur réseau"]
["futur réseau","futur réseau","futur réseau","futur réseau","futur réseau","futur réseau","futur réseau"]
["futur réseau","futur réseau","futur réseau","futur réseau","futur réseau","futur réseau","futur réseau"]
["futur réseau","futur réseau","futur réseau","futur réseau","futur réseau","futur réseau","futur réseau"]
["futur réseau","futur réseau","futur réseau","futur réseau","futur réseau","futur réseau","futur réseau"]
["futur réseau","futur réseau","futur réseau","futur réseau","futur réseau","futur réseau","futur réseau"]
["futur réseau","futur réseau","futur réseau","futur réseau","futur réseau","futur réseau","futur réseau"]
["futur réseau","futur réseau","futur réseau","futur réseau","futur réseau","futur réseau","futur réseau"]
["futur réseau","futur réseau","futur réseau","futur réseau","futur réseau","futur réseau","futur réseau"]
["futur réseau","futur réseau","futur réseau","futur réseau","futur réseau","futur réseau","futur réseau"]
["futur réseau","futur réseau","futur réseau","futur réseau","futur réseau","futur réseau","futur réseau"]

{"sheet":"contrôles","index":8,"n_rows":19,"n_cols":6,"rows_kept":19,"cut":false,"hidden":true,"merged":[]}
[null,"parcours","passage","Date","Heure","Durée du relevé"]
["Oiseaux",{"$f":"'2-OISEAUX'!C6","v":0},1,{"$f":"'2-OISEAUX'!E6","v":""},{"$f":"'2-OISEAUX'!E10","v":""},{"$f":"'2-OISEAUX'!C11","v":0}]
["Oiseaux",{"$f":"'2-OISEAUX'!F6","v":0},1,{"$f":"'2-OISEAUX'!H6","v":""},{"$f":"'2-OISEAUX'!H10","v":""},{"$f":"'2-OISEAUX'!F11","v":0}]
["Oiseaux",{"$f":"'2-OISEAUX'!I6","v":0},1,{"$f":"'2-OISEAUX'!K6","v":""},{"$f":"'2-OISEAUX'!K10","v":""},{"$f":"'2-OISEAUX'!I11","v":0}]
["Oiseaux",{"$f":"'2-OISEAUX'!M6","v":0},1,{"$f":"'2-OISEAUX'!N6","v":""},{"$f":"'2-OISEAUX'!N10","v":""},{"$f":"'2-OISEAUX'!M11","v":0}]
["Oiseaux",{"$f":"'2-OISEAUX'!P6","v":0},1,{"$f":"'2-OISEAUX'!Q6","v":""},{"$f":"'2-OISEAUX'!Q10","v":""},{"$f":"'2-OISEAUX'!P11","v":0}]
[null,"parcours","passage","Date","Heure","Durée du relevé"]
["PapillonI",{"$f":"'3-PAPILLONS'!C6","v":0},1,{"$f":"'3-PAPILLONS'!E10","v":""},{"$f":"'3-PAPILLONS'!E14","v":""},{"$f":"'3-PAPILLONS'!C15","v":0}]
["PapillonII",{"$f":"'3-PAPILLONS'!C6","v":0},2,{"$f":"'3-PAPILLONS'!H10","v":""},{"$f":"'3-PAPILLONS'!H14","v":""},{"$f":"'3-PAPILLONS'!F15","v":0}]
["PapillonI",{"$f":"'3-PAPILLONS'!C42","v":0},1,{"$f":"'3-PAPILLONS'!E48","v":""},{"$f":"'3-PAPILLONS'!E50","v":""},{"$f":"'3-PAPILLONS'!C51","v":0}]
["PapillonII",{"$f":"'3-PAPILLONS'!C42","v":0},2,{"$f":"'3-PAPILLONS'!H48","v":""},{"$f":"'3-PAPILLONS'!H50","v":""},{"$f":"'3-PAPILLONS'!F51","v":0}]
["PapillonI",{"$f":"'3-PAPILLONS'!C78","v":0},1,{"$f":"'3-PAPILLONS'!E84","v":""},{"$f":"'3-PAPILLONS'!E86","v":""},{"$f":"'3-PAPILLONS'!C87","v":0}]
["PapillonII",{"$f":"'3-PAPILLONS'!C78","v":0},2,{"$f":"'3-PAPILLONS'!H84","v":""},{"$f":"'3-PAPILLONS'!H86","v":""},{"$f":"'3-PAPILLONS'!F87","v":0}]
["PapillonI",{"$f":"'3-PAPILLONS'!C114","v":0},1,{"$f":"'3-PAPILLONS'!E120","v":""},{"$f":"'3-PAPILLONS'!E122","v":""},{"$f":"'3-PAPILLONS'!C123","v":0}]
["PapillonII",{"$f":"'3-PAPILLONS'!C114","v":0},2,{"$f":"'3-PAPILLONS'!H120","v":""},{"$f":"'3-PAPILLONS'!H122","v":""},{"$f":"'3-PAPILLONS'!F123","v":0}]
["PapillonI",{"$f":"'3-PAPILLONS'!C150","v":0},1,{"$f":"'3-PAPILLONS'!E156","v":""},{"$f":"'3-PAPILLONS'!E158","v":""},{"$f":"'3-PAPILLONS'!C159","v":0}]
["PapillonII",{"$f":"'3-PAPILLONS'!C150","v":0},2,{"$f":"'3-PAPILLONS'!H156","v":""},{"$f":"'3-PAPILLONS'!H158","v":""},{"$f":"'3-PAPILLONS'!F159","v":0}]
[null,"réseau",null,"Date"]
["Plantes",{"$f":"'4-PLANTES'!E4","v":0},null,{"$f":"'4-PLANTES'!G12","v":""}]

{"sheet":"test TCD","index":9,"n_rows":33,"n_cols":23,"rows_kept":33,"cut":false,"hidden":true,"merged":[]}
[]
["date","(Plusieurs éléments)",null,null,"date","(Plusieurs éléments)",null,null,"indicateur","Présence/absence",null,null,"indicateur","Nbre de sites différents **",null,null,"indicateur","Indice présence/absence"]
[null,null,null,null,"in/out","in",null,null,"in/out","in"]
["Moyenne de Valeur","Étiquettes de colonnes",null,null,null,null,null,null,null,null,null,null,"Somme de Valeur","Étiquettes de colonnes",null,null,"Moyenne de Valeur","Étiquettes de colonnes"]
["Étiquettes de lignes","Total général",null,null,"Moyenne de Valeur","Étiquettes de colonnes",null,null,"Moyenne de Valeur","Étiquettes de colonnes",null,null,"Étiquettes de lignes",2018,"Total général",null,"Étiquettes de lignes",2018,"Total général"]
["Total général",null,null,null,"Étiquettes de lignes","Total général",null,null,"Étiquettes de lignes",2018,"Total général",null,0,0,0,null,0,{"$error":"#DIV/0!"},{"$error":"#DIV/0!"}]
[null,null,null,null,"Total général",null,null,null,0,{"$error":"#DIV/0!"},{"$error":"#DIV/0!"},null,"Total général",0,0,null,"(vide)",{"$error":"#DIV/0!"},{"$error":"#DIV/0!"}]
[null,null,null,null,null,null,null,null,"(vide)",{"$error":"#DIV/0!"},{"$error":"#DIV/0!"},null,null,null,null,null,"Total général",{"$error":"#DIV/0!"},{"$error":"#DIV/0!"}]
[null,null,null,null,null,null,null,null,"Total général",{"$error":"#DIV/0!"},{"$error":"#DIV/0!"}]
[]
[]
[]
[null,null,null,null,null,null,null,null,null,null,null,null,"indicateur","Nbre cumulé de contacts*",null,null,"indicateur","Indice quantitatif"]
[]
[null,null,null,null,null,null,null,null,null,null,null,null,"Somme de Valeur","Étiquettes de colonnes",null,null,"Moyenne de Valeur","Étiquettes de colonnes"]
[null,null,null,null,null,null,null,null,null,null,null,null,"Étiquettes de lignes",2018,"Total général",null,"Étiquettes de lignes",2018,"Total général"]
[null,null,null,null,null,null,null,null,null,null,null,null,0,0,0,null,0,{"$error":"#DIV/0!"},{"$error":"#DIV/0!"}]
[null,null,null,null,null,null,null,null,null,null,null,null,"Total général",0,0,null,"(vide)",{"$error":"#DIV/0!"},{"$error":"#DIV/0!"}]
[null,null,null,null,"date","(Plusieurs éléments)",null,null,null,null,null,null,null,null,null,null,"Total général",{"$error":"#DIV/0!"},{"$error":"#DIV/0!"}]
[null,null,null,null,"in/out","(Plusieurs éléments)"]
[]
[null,null,null,null,"Moyenne de Valeur","Étiquettes de colonnes"]
[null,null,null,null,"Étiquettes de lignes","Total général"]
[null,null,null,null,"Total général"]
[null,null,null,null,null,null,null,null,null,null,null,null,"indicateur","Présence/absence"]
[]
[null,null,null,null,null,null,null,null,null,null,null,null,"Somme de Valeur","Étiquettes de colonnes",null,null,"Moyenne de Valeur","Étiquettes de colonnes"]
[null,null,null,null,null,null,null,null,null,null,null,null,"Étiquettes de lignes",2018,"Total général",null,null,2018,null,null,null,"Total 2018","Total général"]
[null,null,null,null,null,null,null,null,null,null,null,null,0,0,0,null,"Étiquettes de lignes","non"," 1 fois","2-5 fois","> 5 fois"]
[null,null,null,null,null,null,null,null,null,null,null,null,"Total général",0,0,null,0,{"$error":"#DIV/0!"},{"$error":"#DIV/0!"},{"$error":"#DIV/0!"},{"$error":"#DIV/0!"},{"$error":"#DIV/0!"},{"$error":"#DIV/0!"}]
[null,null,null,null,null,null,null,null,null,null,null,null,null,null,null,null,"(vide)",{"$error":"#DIV/0!"},{"$error":"#DIV/0!"},{"$error":"#DIV/0!"},{"$error":"#DIV/0!"},{"$error":"#DIV/0!"},{"$error":"#DIV/0!"}]
[null,null,null,null,null,null,null,null,null,null,null,null,null,null,null,null,"Total général",{"$error":"#DIV/0!"},{"$error":"#DIV/0!"},{"$error":"#DIV/0!"},{"$error":"#DIV/0!"},{"$error":"#DIV/0!"},{"$error":"#DIV/0!"}]
[null,null,null,null,null,null,null," "]

{"sheet":"listes commentaires","index":10,"n_rows":12,"n_cols":2,"rows_kept":12,"cut":false,"hidden":true,"merged":[]}
[]
["Lièvre","Nbre agriculteurs: il faut au moins 10 agriculteurs. Si nbre<10: merci de motiver sous remarques."]
["Lièvre","Il faut au moins 6 réponses valables: veuillez si possible compléter l'enquête auprès d'autres agriculteurs, sinon, motiver sous remarques."]
["Lièvre","Attention le nombre total de réponses doit correspondre au nombre d'agriculteurs. Merci de corriger."]
[]
["Oiseaux","Les relevés doivent être réalisés entre le 15.05. et le 15.06. Merci de justifier sous remarques."]
["Oiseaux","Les relevés doivent être réalisés entre 5h et 11h. Merci de justifier sous remarques."]
[]
["Papillons","Les relevés doivent être réalisés entre le 01.07. et le 15.08. Merci de justifier sous remarques."]
["Papillons","Les relevés doivent être réalisés entre 10h et 17h. Merci de justifier sous remarques."]
[]
["Plantes","Les relevés doivent être réalisés entre le 15.07. et le 15.08. Merci de justifier sous remarques."]

{"sheet":"compilation données pour export","index":11,"n_rows":256,"n_cols":29,"rows_kept":256,"cut":false,"hidden":true,"merged":[]}
["Année","réseau","ID réseau","parcours","Id parcours","Longueur parcours","parcelle","Id parcelle","Nombre de parcelles SPB favorables inscrites au réseau*: ","Nombre de parcelles SPB visitées: ","passage","date","heure début","heure fin","observateur","conditions","espèce français","Abréviation","nom latin","groupe","indicateur","Valeur","in/out","Validation interne"]
[{"$f":"'0-INFOS GENERALES A REMPLIR'!$B$4","v":2021},{"$f":"'0-INFOS GENERALES A REMPLIR'!$B$6","v":0},{"$f":"'0-INFOS GENERALES A REMPLIR'!$E$12","v":""},null,null,null,null,null,null,null,null,null,null,null,null,null,{"$f":"VLOOKUP('compilation données pour export'!$R2,'listes valeurs'!$AF$2:$AI$3450,2,FALSE)","v":"Lièvre brun"},{"$f":"'1-LIEVRE BRUN'!$A$2","v":"LIEVRE BRUN"},{"$f":"VLOOKUP('compilation données pour export'!$R2,'listes valeurs'!$AF$2:$AI$3450,4,FALSE)","v":"Lepus europaeus"},{"$f":"VLOOKUP('compilation données pour export'!$R2,'listes valeurs'!$AF$2:$AI$3450,3,FALSE)","v":"Mammifères"},"Nombre agriculteurs consultés",{"$f":"IF(ISBLANK('1-LIEVRE BRUN'!C12),0,'1-LIEVRE BRUN'!C12)","v":0},"in",{"$f":"'Synthese Annuelle Monitoring'!$Q$14","v":0}]
[{"$f":"'0-INFOS GENERALES A REMPLIR'!$B$4","v":2021},{"$f":"'0-INFOS GENERALES A REMPLIR'!$B$6","v":0},{"$f":"'0-INFOS GENERALES A REMPLIR'!$E$12","v":""},null,null,null,null,null,null,null,null,null,null,null,null,null,{"$f":"VLOOKUP('compilation données pour export'!$R3,'listes valeurs'!$AF$2:$AI$3450,2,FALSE)","v":"Lièvre brun"},{"$f":"'1-LIEVRE BRUN'!$A$2","v":"LIEVRE BRUN"},{"$f":"VLOOKUP('compilation données pour export'!$R3,'listes valeurs'!$AF$2:$AI$3450,4,FALSE)","v":"Lepus europaeus"},{"$f":"VLOOKUP('compilation données pour export'!$R3,'listes valeurs'!$AF$2:$AI$3450,3,FALSE)","v":"Mammifères"},"ne sait pas",{"$f":"IF(ISBLANK('1-LIEVRE BRUN'!C15),0,'1-LIEVRE BRUN'!C15)","v":0},"in",{"$f":"'Synthese Annuelle Monitoring'!$Q$14","v":0}]
[{"$f":"'0-INFOS GENERALES A REMPLIR'!$B$4","v":2021},{"$f":"'0-INFOS GENERALES A REMPLIR'!$B$6","v":0},{"$f":"'0-INFOS GENERALES A REMPLIR'!$E$12","v":""},null,null,null,null,null,null,null,null,null,null,null,null,null,{"$f":"VLOOKUP('compilation données pour export'!$R4,'listes valeurs'!$AF$2:$AI$3450,2,FALSE)","v":"Lièvre brun"},{"$f":"'1-LIEVRE BRUN'!$A$2","v":"LIEVRE BRUN"},{"$f":"VLOOKUP('compilation données pour export'!$R4,'listes valeurs'!$AF$2:$AI$3450,4,FALSE)","v":"Lepus europaeus"},{"$f":"VLOOKUP('compilation données pour export'!$R4,'listes valeurs'!$AF$2:$AI$3450,3,FALSE)","v":"Mammifères"}," 1 fois",{"$f":"IF(ISBLANK('1-LIEVRE BRUN'!C16),0,'1-LIEVRE BRUN'!C16)","v":0},"in",{"$f":"'Synthese Annuelle Monitoring'!$Q$14","v":0}]
[{"$f":"'0-INFOS GENERALES A REMPLIR'!$B$4","v":2021},{"$f":"'0-INFOS GENERALES A REMPLIR'!$B$6","v":0},{"$f":"'0-INFOS GENERALES A REMPLIR'!$E$12","v":""},null,null,null,null,null,null,null,null,null,null,null,null,null,{"$f":"VLOOKUP('compilation données pour export'!$R5,'listes valeurs'!$AF$2:$AI$3450,2,FALSE)","v":"Lièvre brun"},{"$f":"'1-LIEVRE BRUN'!$A$2","v":"LIEVRE BRUN"},{"$f":"VLOOKUP('compilation données pour export'!$R5,'listes valeurs'!$AF$2:$AI$3450,4,FALSE)","v":"Lepus europaeus"},{"$f":"VLOOKUP('compilation données pour export'!$R5,'listes valeurs'!$AF$2:$AI$3450,3,FALSE)","v":"Mammifères"},"2-5 fois",{"$f":"IF(ISBLANK('1-LIEVRE BRUN'!C17),0,'1-LIEVRE BRUN'!C17)","v":0},"in",{"$f":"'Synthese Annuelle Monitoring'!$Q$14","v":0}]
[{"$f":"'0-INFOS GENERALES A REMPLIR'!$B$4","v":2021},{"$f":"'0-INFOS GENERALES A REMPLIR'!$B$6","v":0},{"$f":"'0-INFOS GENERALES A REMPLIR'!$E$12","v":""},null,null,null,null,null,null,null,null,null,null,null,null,null,{"$f":"VLOOKUP('compilation données pour export'!$R6,'listes valeurs'!$AF$2:$AI$3450,2,FALSE)","v":"Lièvre brun"},{"$f":"'1-LIEVRE BRUN'!$A$2","v":"LIEVRE BRUN"},{"$f":"VLOOKUP('compilation données pour export'!$R6,'listes valeurs'!$AF$2:$AI$3450,4,FALSE)","v":"Lepus europaeus"},{"$f":"VLOOKUP('compilation données pour export'!$R6,'listes valeurs'!$AF$2:$AI$3450,3,FALSE)","v":"Mammifères"},"> 5 fois",{"$f":"IF(ISBLANK('1-LIEVRE BRUN'!C18),0,'1-LIEVRE BRUN'!C18)","v":0},"in",{"$f":"'Synthese Annuelle Monitoring'!$Q$14","v":0}]
[{"$f":"'0-INFOS GENERALES A REMPLIR'!$B$4","v":2021},{"$f":"'0-INFOS GENERALES A REMPLIR'!$B$6","v":0},{"$f":"'0-INFOS GENERALES A REMPLIR'!$E$12","v":""},null,null,null,null,null,null,null,null,null,null,null,null,null,{"$f":"VLOOKUP('compilation données pour export'!$R7,'listes valeurs'!$AF$2:$AI$3450,2,FALSE)","v":"Lièvre brun"},{"$f":"'1-LIEVRE BRUN'!$A$2","v":"LIEVRE BRUN"},{"$f":"VLOOKUP('compilation données pour export'!$R7,'listes valeurs'!$AF$2:$AI$3450,4,FALSE)","v":"Lepus europaeus"},{"$f":"VLOOKUP('compilation données pour export'!$R7,'listes valeurs'!$AF$2:$AI$3450,3,FALSE)","v":"Mammifères"},"non",{"$f":"IF(ISBLANK('1-LIEVRE BRUN'!C19),0,'1-LIEVRE BRUN'!C19)","v":0},"in",{"$f":"'Synthese Annuelle Monitoring'!$Q$14","v":0}]
[{"$f":"'0-INFOS GENERALES A REMPLIR'!$B$4","v":2021},{"$f":"'0-INFOS GENERALES A REMPLIR'!$B$6","v":0},{"$f":"'0-INFOS GENERALES A REMPLIR'!$E$12","v":""},null,null,null,null,null,null,null,null,null,null,null,null,null,{"$f":"VLOOKUP('compilation données pour export'!$R8,'listes valeurs'!$AF$2:$AI$3450,2,FALSE)","v":"Lièvre brun"},{"$f":"'1-LIEVRE BRUN'!$A$2","v":"LIEVRE BRUN"},{"$f":"VLOOKUP('compilation données pour export'!$R8,'listes valeurs'!$AF$2:$AI$3450,4,FALSE)","v":"Lepus europaeus"},{"$f":"VLOOKUP('compilation données pour export'!$R8,'listes valeurs'!$AF$2:$AI$3450,3,FALSE)","v":"Mammifères"},"Indice présence/absence",{"$f":"IF(OR(V2=\"\",V2=0),\"\",SUM(V4:V6)/SUM(V4:V7))","v":""},"in",{"$f":"'Synthese Annuelle Monitoring'!$Q$14","v":0}]
[{"$f":"'0-INFOS GENERALES A REMPLIR'!$B$4","v":2021},{"$f":"'0-INFOS GENERALES A REMPLIR'!$B$6","v":0},{"$f":"'0-INFOS GENERALES A REMPLIR'!$E$12","v":""},null,null,null,null,null,null,null,null,null,null,null,null,null,{"$f":"VLOOKUP('compilation données pour export'!$R9,'listes valeurs'!$AF$2:$AI$3450,2,FALSE)","v":"Lièvre brun"},{"$f":"'1-LIEVRE BRUN'!$A$2","v":"LIEVRE BRUN"},{"$f":"VLOOKUP('compilation données pour export'!$R9,'listes valeurs'!$AF$2:$AI$3450,4,FALSE)","v":"Lepus europaeus"},{"$f":"VLOOKUP('compilation données pour export'!$R9,'listes valeurs'!$AF$2:$AI$3450,3,FALSE)","v":"Mammifères"},"Indice quantitatif",{"$f":"IF(OR(V2=\"\",V2=0),\"\",SUM(V4*1,V5*3.5,V6*7)/SUM(V4:V7))","v":""},"in",{"$f":"'Synthese Annuelle Monitoring'!$Q$14","v":0}]
[{"$f":"'0-INFOS GENERALES A REMPLIR'!$B$4","v":2021},{"$f":"'0-INFOS GENERALES A REMPLIR'!$B$6","v":0},{"$f":"IF(ISBLANK('0-INFOS GENERALES A REMPLIR'!$E$12),\"\",'0-INFOS GENERALES A REMPLIR'!$E$12)","v":""},{"$f":"IF(ISBLANK('0-INFOS GENERALES A REMPLIR'!$A$12),\"\",'0-INFOS GENERALES A REMPLIR'!$A$12)","v":""},{"$f":"IF(ISBLANK('0-INFOS GENERALES A REMPLIR'!$D$12),\"\",'0-INFOS GENERALES A REMPLIR'!$D$12)","v":""},{"$f":"IFERROR(INDEX('listes valeurs'!F$2:F$552,MATCH(1,('listes valeurs'!B$2:B$552=B10)*('listes valeurs'!E$2:E$552=D10),0)),\"\")","v":""},null,null,null,null,null,{"$f":"IF(ISBLANK('2-OISEAUX'!$C$9),\"\",'2-OISEAUX'!$C$9)","v":""},{"$f":"IF(ISBLANK('2-OISEAUX'!$C$10),\"\",'2-OISEAUX'!$C$10)","v":""},{"$f":"IF(ISBLANK('2-OISEAUX'!$D$10),\"\",'2-OISEAUX'!$D$10)","v":""},{"$f":"IF(ISBLANK('2-OISEAUX'!$C$13),\"\",'2-OISEAUX'!$C$13)","v":""},{"$f":"IF(ISBLANK('2-OISEAUX'!$C$8),\"\",'2-OISEAUX'!$C$8)","v":""},{"$f":"VLOOKUP('compilation données pour export'!$R10,'listes valeurs'!$T$2:$W$3450,2,FALSE)","v":"Alouette des champs"},{"$f":"'2-OISEAUX'!$A$16","v":"ALC"},{"$f":"VLOOKUP('compilation données pour export'!$R10,'listes valeurs'!$T$2:$W$3450,4,FALSE)","v":"Alauda arvensis                         "},{"$f":"VLOOKUP('compilation données pour export'!$R10,'listes valeurs'!$T$2:$W$3450,3,FALSE)","v":"Oiseaux"},"Nombre de territoires",{"$f":"IF(ISBLANK('2-OISEAUX'!$C$16),\"\",'2-OISEAUX'!$C$16)","v":""},"in",{"$f":"'Synthese Annuelle Monitoring'!$Q$17","v":0}]
[{"$f":"'0-INFOS GENERALES A REMPLIR'!$B$4","v":2021},{"$f":"'0-INFOS GENERALES A REMPLIR'!$B$6","v":0},{"$f":"IF(ISBLANK('0-INFOS GENERALES A REMPLIR'!$E$13),\"\",'0-INFOS GENERALES A REMPLIR'!$E$13)","v":""},{"$f":"IF(ISBLANK('0-INFOS GENERALES A REMPLIR'!$A$13),\"\",'0-INFOS GENERALES A REMPLIR'!$A$13)","v":""},{"$f":"IF(ISBLANK('0-INFOS GENERALES A REMPLIR'!$D$13),\"\",'0-INFOS GENERALES A REMPLIR'!$D$13)","v":""},{"$f":"IFERROR(INDEX('listes valeurs'!F$2:F$552,MATCH(1,('listes valeurs'!B$2:B$552=B11)*('listes valeurs'!E$2:E$552=D11),0)),\"\")","v":""},null,null,null,null,null,{"$f":"IF(ISBLANK('2-OISEAUX'!$F$9),\"\",'2-OISEAUX'!$F$9)","v":""},{"$f":"IF(ISBLANK('2-OISEAUX'!$F$10),\"\",'2-OISEAUX'!$F$10)","v":""},{"$f":"IF(ISBLANK('2-OISEAUX'!$G$10),\"\",'2-OISEAUX'!$G$10)","v":""},{"$f":"IF(ISBLANK('2-OISEAUX'!$F$13),\"\",'2-OISEAUX'!$F$13)","v":""},{"$f":"IF(ISBLANK('2-OISEAUX'!$F$8),\"\",'2-OISEAUX'!$F$8)","v":""},{"$f":"VLOOKUP('compilation données pour export'!$R11,'listes valeurs'!$T$2:$W$3450,2,FALSE)","v":"Alouette des champs"},{"$f":"'2-OISEAUX'!$A$16","v":"ALC"},{"$f":"VLOOKUP('compilation données pour export'!$R11,'listes valeurs'!$T$2:$W$3450,4,FALSE)","v":"Alauda arvensis                         "},{"$f":"VLOOKUP('compilation données pour export'!$R11,'listes valeurs'!$T$2:$W$3450,3,FALSE)","v":"Oiseaux"},"Nombre de territoires",{"$f":"IF(ISBLANK('2-OISEAUX'!$F16),\"\",'2-OISEAUX'!$F$16)","v":""},"in",{"$f":"'Synthese Annuelle Monitoring'!$Q$17","v":0}]
[{"$f":"'0-INFOS GENERALES A REMPLIR'!$B$4","v":2021},{"$f":"'0-INFOS GENERALES A REMPLIR'!$B$6","v":0},{"$f":"IF(ISBLANK('0-INFOS GENERALES A REMPLIR'!$E$14),\"\",'0-INFOS GENERALES A REMPLIR'!$E$14)","v":""},{"$f":"IF(ISBLANK('0-INFOS GENERALES A REMPLIR'!$A$14),\"\",'0-INFOS GENERALES A REMPLIR'!$A$14)","v":""},{"$f":"IF(ISBLANK('0-INFOS GENERALES A REMPLIR'!$D$14),\"\",'0-INFOS GENERALES A REMPLIR'!$D$14)","v":""},{"$f":"IFERROR(INDEX('listes valeurs'!F$2:F$552,MATCH(1,('listes valeurs'!B$2:B$552=B12)*('listes valeurs'!E$2:E$552=D12),0)),\"\")","v":""},null,null,null,null,null,{"$f":"IF(ISBLANK('2-OISEAUX'!$I$9),\"\",'2-OISEAUX'!$I$9)","v":""},{"$f":"IF(ISBLANK('2-OISEAUX'!$I$10),\"\",'2-OISEAUX'!$I$10)","v":""},{"$f":"IF(ISBLANK('2-OISEAUX'!$J$10),\"\",'2-OISEAUX'!$J$10)","v":""},{"$f":"IF(ISBLANK('2-OISEAUX'!$I$13),\"\",'2-OISEAUX'!$I$13)","v":""},{"$f":"IF(ISBLANK('2-OISEAUX'!$I$8),\"\",'2-OISEAUX'!$I$8)","v":""},{"$f":"VLOOKUP('compilation données pour export'!$R12,'listes valeurs'!$T$2:$W$3450,2,FALSE)","v":"Alouette des champs"},{"$f":"'2-OISEAUX'!$A$16","v":"ALC"},{"$f":"VLOOKUP('compilation données pour export'!$R12,'listes valeurs'!$T$2:$W$3450,4,FALSE)","v":"Alauda arvensis                         "},{"$f":"VLOOKUP('compilation données pour export'!$R12,'listes valeurs'!$T$2:$W$3450,3,FALSE)","v":"Oiseaux"},"Nombre de territoires",{"$f":"IF(ISBLANK('2-OISEAUX'!$I$16),\"\",'2-OISEAUX'!$I$16)","v":""},"in",{"$f":"'Synthese Annuelle Monitoring'!$Q$17","v":0}]
[{"$f":"'0-INFOS GENERALES A REMPLIR'!$B$4","v":2021},{"$f":"'0-INFOS GENERALES A REMPLIR'!$B$6","v":0},{"$f":"IF(ISBLANK('0-INFOS GENERALES A REMPLIR'!$E$15),\"\",'0-INFOS GENERALES A REMPLIR'!$E$15)","v":""},{"$f":"IF(ISBLANK('0-INFOS GENERALES A REMPLIR'!$A$15),\"\",'0-INFOS GENERALES A REMPLIR'!$A$15)","v":""},{"$f":"IF(ISBLANK('0-INFOS GENERALES A REMPLIR'!$D$15),\"\",'0-INFOS GENERALES A REMPLIR'!$D$15)","v":""},{"$f":"IFERROR(INDEX('listes valeurs'!F$2:F$552,MATCH(1,('listes valeurs'!B$2:B$552=B13)*('listes valeurs'!E$2:E$552=D13),0)),\"\")","v":""},null,null,null,null,null,{"$f":"IF(ISBLANK('2-OISEAUX'!$L$9),\"\",'2-OISEAUX'!$L$9)","v":""},{"$f":"IF(ISBLANK('2-OISEAUX'!$L$10),\"\",'2-OISEAUX'!$L$10)","v":""},{"$f":"IF(ISBLANK('2-OISEAUX'!$M$10),\"\",'2-OISEAUX'!$M$10)","v":""},{"$f":"IF(ISBLANK('2-OISEAUX'!$L$13),\"\",'2-OISEAUX'!$L$13)","v":""},{"$f":"IF(ISBLANK('2-OISEAUX'!$L$8),\"\",'2-OISEAUX'!$L$8)","v":""},{"$f":"VLOOKUP('compilation données pour export'!$R13,'listes valeurs'!$T$2:$W$3450,2,FALSE)","v":"Alouette des champs"},{"$f":"'2-OISEAUX'!$A$16","v":"ALC"},{"$f":"VLOOKUP('compilation données pour export'!$R13,'listes valeurs'!$T$2:$W$3450,4,FALSE)","v":"Alauda arvensis                         "},{"$f":"VLOOKUP('compilation données pour export'!$R13,'listes valeurs'!$T$2:$W$3450,3,FALSE)","v":"Oiseaux"},"Nombre de territoires",{"$f":"IF(ISBLANK('2-OISEAUX'!$L$16),\"\",'2-OISEAUX'!$L$16)","v":""},"in",{"$f":"'Synthese Annuelle Monitoring'!$Q$17","v":0}]
[{"$f":"'0-INFOS GENERALES A REMPLIR'!$B$4","v":2021},{"$f":"'0-INFOS GENERALES A REMPLIR'!$B$6","v":0},{"$f":"IF(ISBLANK('0-INFOS GENERALES A REMPLIR'!$E$16),\"\",'0-INFOS GENERALES A REMPLIR'!$E$16)","v":""},{"$f":"IF(ISBLANK('0-INFOS GENERALES A REMPLIR'!$A$16),\"\",'0-INFOS GENERALES A REMPLIR'!$A$16)","v":""},{"$f":"IF(ISBLANK('0-INFOS GENERALES A REMPLIR'!$D$16),\"\",'0-INFOS GENERALES A REMPLIR'!$D$16)","v":""},{"$f":"IFERROR(INDEX('listes valeurs'!F$2:F$552,MATCH(1,('listes valeurs'!B$2:B$552=B14)*('listes valeurs'!E$2:E$552=D14),0)),\"\")","v":""},null,null,null,null,null,{"$f":"IF(ISBLANK('2-OISEAUX'!$O$9),\"\",'2-OISEAUX'!$O$9)","v":""},{"$f":"IF(ISBLANK('2-OISEAUX'!$O$10),\"\",'2-OISEAUX'!$O$10)","v":""},{"$f":"IF(ISBLANK('2-OISEAUX'!$P$10),\"\",'2-OISEAUX'!$P$10)","v":""},{"$f":"IF(ISBLANK('2-OISEAUX'!$O$13),\"\",'2-OISEAUX'!$O$13)","v":""},{"$f":"IF(ISBLANK('2-OISEAUX'!$O$8),\"\",'2-OISEAUX'!$O$8)","v":""},{"$f":"VLOOKUP('compilation données pour export'!$R14,'listes valeurs'!$T$2:$W$3450,2,FALSE)","v":"Alouette des champs"},{"$f":"'2-OISEAUX'!$A$16","v":"ALC"},{"$f":"VLOOKUP('compilation données pour export'!$R14,'listes valeurs'!$T$2:$W$3450,4,FALSE)","v":"Alauda arvensis                         "},{"$f":"VLOOKUP('compilation données pour export'!$R14,'listes valeurs'!$T$2:$W$3450,3,FALSE)","v":"Oiseaux"},"Nombre de territoires",{"$f":"IF(ISBLANK('2-OISEAUX'!$O$16),\"\",'2-OISEAUX'!$O$16)","v":""},"in",{"$f":"'Synthese Annuelle Monitoring'!$Q$17","v":0},"Attention si uniquement l'enquête lièvre a étét effectuéeet aucun parcours n'a été effectué, alors ne pas exporter les données lézard, ni des autres groupes"]
[{"$f":"'0-INFOS GENERALES A REMPLIR'!$B$4","v":2021},{"$f":"'0-INFOS GENERALES A REMPLIR'!$B$6","v":0},{"$f":"IF(ISBLANK('0-INFOS GENERALES A REMPLIR'!$E$12),\"\",'0-INFOS GENERALES A REMPLIR'!$E$12)","v":""},{"$f":"IF(ISBLANK('0-INFOS GENERALES A REMPLIR'!$A$12),\"\",'0-INFOS GENERALES A REMPLIR'!$A$12)","v":""},{"$f":"IF(ISBLANK('0-INFOS GENERALES A REMPLIR'!$D$12),\"\",'0-INFOS GENERALES A REMPLIR'!$D$12)","v":""},{"$f":"IFERROR(INDEX('listes valeurs'!F$2:F$552,MATCH(1,('listes valeurs'!B$2:B$552=B15)*('listes valeurs'!E$2:E$552=D15),0)),\"\")","v":""},null,null,null,null,null,{"$f":"IF(ISBLANK('2-OISEAUX'!$C$9),\"\",'2-OISEAUX'!$C$9)","v":""},{"$f":"IF(ISBLANK('2-OISEAUX'!$C$10),\"\",'2-OISEAUX'!$C$10)","v":""},{"$f":"IF(ISBLANK('2-OISEAUX'!$D$10),\"\",'2-OISEAUX'!$D$10)","v":""},{"$f":"IF(ISBLANK('2-OISEAUX'!$C$13),\"\",'2-OISEAUX'!$C$13)","v":""},{"$f":"IF(ISBLANK('2-OISEAUX'!$C$8),\"\",'2-OISEAUX'!$C$8)","v":""},{"$f":"VLOOKUP('compilation données pour export'!$R15,'listes valeurs'!$T$2:$W$3450,2,FALSE)","v":"Bruant jaune"},{"$f":"'2-OISEAUX'!$A$17","v":"BRJ"},{"$f":"VLOOKUP('compilation données pour export'!$R15,'listes valeurs'!$T$2:$W$3450,4,FALSE)","v":"Emberiza citrinella                     "},{"$f":"VLOOKUP('compilation données pour export'!$R15,'listes valeurs'!$T$2:$W$3450,3,FALSE)","v":"Oiseaux"},"Nombre de territoires",{"$f":"IF(ISBLANK('2-OISEAUX'!$C$17),\"\",'2-OISEAUX'!$C$17)","v":""},"in",{"$f":"'Synthese Annuelle Monitoring'!$Q$18","v":0}]
[{"$f":"'0-INFOS GENERALES A REMPLIR'!$B$4","v":2021},{"$f":"'0-INFOS GENERALES A REMPLIR'!$B$6","v":0},{"$f":"IF(ISBLANK('0-INFOS GENERALES A REMPLIR'!$E$13),\"\",'0-INFOS GENERALES A REMPLIR'!$E$13)","v":""},{"$f":"IF(ISBLANK('0-INFOS GENERALES A REMPLIR'!$A$13),\"\",'0-INFOS GENERALES A REMPLIR'!$A$13)","v":""},{"$f":"IF(ISBLANK('0-INFOS GENERALES A REMPLIR'!$D$13),\"\",'0-INFOS GENERALES A REMPLIR'!$D$13)","v":""},{"$f":"IFERROR(INDEX('listes valeurs'!F$2:F$552,MATCH(1,('listes valeurs'!B$2:B$552=B16)*('listes valeurs'!E$2:E$552=D16),0)),\"\")","v":""},null,null,null,null,null,{"$f":"IF(ISBLANK('2-OISEAUX'!$F$9),\"\",'2-OISEAUX'!$F$9)","v":""},{"$f":"IF(ISBLANK('2-OISEAUX'!$F$10),\"\",'2-OISEAUX'!$F$10)","v":""},{"$f":"IF(ISBLANK('2-OISEAUX'!$G$10),\"\",'2-OISEAUX'!$G$10)","v":""},{"$f":"IF(ISBLANK('2-OISEAUX'!$F$13),\"\",'2-OISEAUX'!$F$13)","v":""},{"$f":"IF(ISBLANK('2-OISEAUX'!$F$8),\"\",'2-OISEAUX'!$F$8)","v":""},{"$f":"VLOOKUP('compilation données pour export'!$R16,'listes valeurs'!$T$2:$W$3450,2,FALSE)","v":"Bruant jaune"},{"$f":"'2-OISEAUX'!$A$17","v":"BRJ"},{"$f":"VLOOKUP('compilation données pour export'!$R16,'listes valeurs'!$T$2:$W$3450,4,FALSE)","v":"Emberiza citrinella                     "},{"$f":"VLOOKUP('compilation données pour export'!$R16,'listes valeurs'!$T$2:$W$3450,3,FALSE)","v":"Oiseaux"},"Nombre de territoires",{"$f":"IF(ISBLANK('2-OISEAUX'!$F$17),\"\",'2-OISEAUX'!$F$17)","v":""},"in",{"$f":"'Synthese Annuelle Monitoring'!$Q$18","v":0}]
[{"$f":"'0-INFOS GENERALES A REMPLIR'!$B$4","v":2021},{"$f":"'0-INFOS GENERALES A REMPLIR'!$B$6","v":0},{"$f":"IF(ISBLANK('0-INFOS GENERALES A REMPLIR'!$E$14),\"\",'0-INFOS GENERALES A REMPLIR'!$E$14)","v":""},{"$f":"IF(ISBLANK('0-INFOS GENERALES A REMPLIR'!$A$14),\"\",'0-INFOS GENERALES A REMPLIR'!$A$14)","v":""},{"$f":"IF(ISBLANK('0-INFOS GENERALES A REMPLIR'!$D$14),\"\",'0-INFOS GENERALES A REMPLIR'!$D$14)","v":""},{"$f":"IFERROR(INDEX('listes valeurs'!F$2:F$552,MATCH(1,('listes valeurs'!B$2:B$552=B17)*('listes valeurs'!E$2:E$552=D17),0)),\"\")","v":""},null,null,null,null,null,{"$f":"IF(ISBLANK('2-OISEAUX'!$I$9),\"\",'2-OISEAUX'!$I$9)","v":""},{"$f":"IF(ISBLANK('2-OISEAUX'!$I$10),\"\",'2-OISEAUX'!$I$10)","v":""},{"$f":"IF(ISBLANK('2-OISEAUX'!$J$10),\"\",'2-OISEAUX'!$J$10)","v":""},{"$f":"IF(ISBLANK('2-OISEAUX'!$I$13),\"\",'2-OISEAUX'!$I$13)","v":""},{"$f":"IF(ISBLANK('2-OISEAUX'!$I$8),\"\",'2-OISEAUX'!$I$8)","v":""},{"$f":"VLOOKUP('compilation données pour export'!$R17,'listes valeurs'!$T$2:$W$3450,2,FALSE)","v":"Bruant jaune"},{"$f":"'2-OISEAUX'!$A$17","v":"BRJ"},{"$f":"VLOOKUP('compilation données pour export'!$R17,'listes valeurs'!$T$2:$W$3450,4,FALSE)","v":"Emberiza citrinella                     "},{"$f":"VLOOKUP('compilation données pour export'!$R17,'listes valeurs'!$T$2:$W$3450,3,FALSE)","v":"Oiseaux"},"Nombre de territoires",{"$f":"IF(ISBLANK('2-OISEAUX'!$I$17),\"\",'2-OISEAUX'!$I$17)","v":""},"in",{"$f":"'Synthese Annuelle Monitoring'!$Q$18","v":0}]
[{"$f":"'0-INFOS GENERALES A REMPLIR'!$B$4","v":2021},{"$f":"'0-INFOS GENERALES A REMPLIR'!$B$6","v":0},{"$f":"IF(ISBLANK('0-INFOS GENERALES A REMPLIR'!$E$15),\"\",'0-INFOS GENERALES A REMPLIR'!$E$15)","v":""},{"$f":"IF(ISBLANK('0-INFOS GENERALES A REMPLIR'!$A$15),\"\",'0-INFOS GENERALES A REMPLIR'!$A$15)","v":""},{"$f":"IF(ISBLANK('0-INFOS GENERALES A REMPLIR'!$D$15),\"\",'0-INFOS GENERALES A REMPLIR'!$D$15)","v":""},{"$f":"IFERROR(INDEX('listes valeurs'!F$2:F$552,MATCH(1,('listes valeurs'!B$2:B$552=B18)*('listes valeurs'!E$2:E$552=D18),0)),\"\")","v":""},null,null,null,null,null,{"$f":"IF(ISBLANK('2-OISEAUX'!$L$9),\"\",'2-OISEAUX'!$L$9)","v":""},{"$f":"IF(ISBLANK('2-OISEAUX'!$L$10),\"\",'2-OISEAUX'!$L$10)","v":""},{"$f":"IF(ISBLANK('2-OISEAUX'!$M$10),\"\",'2-OISEAUX'!$M$10)","v":""},{"$f":"IF(ISBLANK('2-OISEAUX'!$L$13),\"\",'2-OISEAUX'!$L$13)","v":""},{"$f":"IF(ISBLANK('2-OISEAUX'!$L$8),\"\",'2-OISEAUX'!$L$8)","v":""},{"$f":"VLOOKUP('compilation données pour export'!$R18,'listes valeurs'!$T$2:$W$3450,2,FALSE)","v":"Bruant jaune"},{"$f":"'2-OISEAUX'!$A$17","v":"BRJ"},{"$f":"VLOOKUP('compilation données pour export'!$R18,'listes valeurs'!$T$2:$W$3450,4,FALSE)","v":"Emberiza citrinella                     "},{"$f":"VLOOKUP('compilation données pour export'!$R18,'listes valeurs'!$T$2:$W$3450,3,FALSE)","v":"Oiseaux"},"Nombre de territoires",{"$f":"IF(ISBLANK('2-OISEAUX'!$L$17),\"\",'2-OISEAUX'!$L$17)","v":""},"in",{"$f":"'Synthese Annuelle Monitoring'!$Q$18","v":0},null,null,null,null,"bouton à créer éventuellement si nécessaire: à décider lors du premier export"]
[{"$f":"'0-INFOS GENERALES A REMPLIR'!$B$4","v":2021},{"$f":"'0-INFOS GENERALES A REMPLIR'!$B$6","v":0},{"$f":"IF(ISBLANK('0-INFOS GENERALES A REMPLIR'!$E$16),\"\",'0-INFOS GENERALES A REMPLIR'!$E$16)","v":""},{"$f":"IF(ISBLANK('0-INFOS GENERALES A REMPLIR'!$A$16),\"\",'0-INFOS GENERALES A REMPLIR'!$A$16)","v":""},{"$f":"IF(ISBLANK('0-INFOS GENERALES A REMPLIR'!$D$16),\"\",'0-INFOS GENERALES A REMPLIR'!$D$16)","v":""},{"$f":"IFERROR(INDEX('listes valeurs'!F$2:F$552,MATCH(1,('listes valeurs'!B$2:B$552=B19)*('listes valeurs'!E$2:E$552=D19),0)),\"\")","v":""},null,null,null,null,null,{"$f":"IF(ISBLANK('2-OISEAUX'!$O$9),\"\",'2-OISEAUX'!$O$9)","v":""},{"$f":"IF(ISBLANK('2-OISEAUX'!$O$10),\"\",'2-OISEAUX'!$O$10)","v":""},{"$f":"IF(ISBLANK('2-OISEAUX'!$P$10),\"\",'2-OISEAUX'!$P$10)","v":""},{"$f":"IF(ISBLANK('2-OISEAUX'!$O$13),\"\",'2-OISEAUX'!$O$13)","v":""},{"$f":"IF(ISBLANK('2-OISEAUX'!$O$8),\"\",'2-OISEAUX'!$O$8)","v":""},{"$f":"VLOOKUP('compilation données pour export'!$R19,'listes valeurs'!$T$2:$W$3450,2,FALSE)","v":"Bruant jaune"},{"$f":"'2-OISEAUX'!$A$17","v":"BRJ"},{"$f":"VLOOKUP('compilation données pour export'!$R19,'listes valeurs'!$T$2:$W$3450,4,FALSE)","v":"Emberiza citrinella                     "},{"$f":"VLOOKUP('compilation données pour export'!$R19,'listes valeurs'!$T$2:$W$3450,3,FALSE)","v":"Oiseaux"},"Nombre de territoires",{"$f":"IF(ISBLANK('2-OISEAUX'!$O$17),\"\",'2-OISEAUX'!$O$17)","v":""},"in",{"$f":"'Synthese Annuelle Monitoring'!$Q$18","v":0}]
[{"$f":"'0-INFOS GENERALES A REMPLIR'!$B$4","v":2021},{"$f":"'0-INFOS GENERALES A REMPLIR'!$B$6","v":0},{"$f":"IF(ISBLANK('0-INFOS GENERALES A REMPLIR'!$E$12),\"\",'0-INFOS GENERALES A REMPLIR'!$E$12)","v":""},{"$f":"IF(ISBLANK('0-INFOS GENERALES A REMPLIR'!$A$12),\"\",'0-INFOS GENERALES A REMPLIR'!$A$12)","v":""},{"$f":"IF(ISBLANK('0-INFOS GENERALES A REMPLIR'!$D$12),\"\",'0-INFOS GENERALES A REMPLIR'!$D$12)","v":""},{"$f":"IFERROR(INDEX('listes valeurs'!F$2:F$552,MATCH(1,('listes valeurs'!B$2:B$552=B20)*('listes valeurs'!E$2:E$552=D20),0)),\"\")","v":""},null,null,null,null,null,{"$f":"IF(ISBLANK('2-OISEAUX'!$C$9),\"\",'2-OISEAUX'!$C$9)","v":""},{"$f":"IF(ISBLANK('2-OISEAUX'!$C$10),\"\",'2-OISEAUX'!$C$10)","v":""},{"$f":"IF(ISBLANK('2-OISEAUX'!$D$10),\"\",'2-OISEAUX'!$D$10)","v":""},{"$f":"IF(ISBLANK('2-OISEAUX'!$C$13),\"\",'2-OISEAUX'!$C$13)","v":""},{"$f":"IF(ISBLANK('2-OISEAUX'!$C$8),\"\",'2-OISEAUX'!$C$8)","v":""},{"$f":"VLOOKUP('compilation données pour export'!$R20,'listes valeurs'!$T$2:$W$3450,2,FALSE)","v":"Bruant proyer"},{"$f":"'2-OISEAUX'!$A$18","v":"BRP"},{"$f":"VLOOKUP('compilation données pour export'!$R20,'listes valeurs'!$T$2:$W$3450,4,FALSE)","v":"Emberiza calandra                       "},{"$f":"VLOOKUP('compilation données pour export'!$R20,'listes valeurs'!$T$2:$W$3450,3,FALSE)","v":"Oiseaux"},"Nombre de territoires",{"$f":"IF(ISBLANK('2-OISEAUX'!$C$18),\"\",'2-OISEAUX'!$C$18)","v":""},"in",{"$f":"'Synthese Annuelle Monitoring'!$Q$19","v":0}]
[{"$f":"'0-INFOS GENERALES A REMPLIR'!$B$4","v":2021},{"$f":"'0-INFOS GENERALES A REMPLIR'!$B$6","v":0},{"$f":"IF(ISBLANK('0-INFOS GENERALES A REMPLIR'!$E$13),\"\",'0-INFOS GENERALES A REMPLIR'!$E$13)","v":""},{"$f":"IF(ISBLANK('0-INFOS GENERALES A REMPLIR'!$A$13),\"\",'0-INFOS GENERALES A REMPLIR'!$A$13)","v":""},{"$f":"IF(ISBLANK('0-INFOS GENERALES A REMPLIR'!$D$13),\"\",'0-INFOS GENERALES A REMPLIR'!$D$13)","v":""},{"$f":"IFERROR(INDEX('listes valeurs'!F$2:F$552,MATCH(1,('listes valeurs'!B$2:B$552=B21)*('listes valeurs'!E$2:E$552=D21),0)),\"\")","v":""},null,null,null,null,null,{"$f":"IF(ISBLANK('2-OISEAUX'!$F$9),\"\",'2-OISEAUX'!$F$9)","v":""},{"$f":"IF(ISBLANK('2-OISEAUX'!$F$10),\"\",'2-OISEAUX'!$F$10)","v":""},{"$f":"IF(ISBLANK('2-OISEAUX'!$G$10),\"\",'2-OISEAUX'!$G$10)","v":""},{"$f":"IF(ISBLANK('2-OISEAUX'!$F$13),\"\",'2-OISEAUX'!$F$13)","v":""},{"$f":"IF(ISBLANK('2-OISEAUX'!$F$8),\"\",'2-OISEAUX'!$F$8)","v":""},{"$f":"VLOOKUP('compilation données pour export'!$R21,'listes valeurs'!$T$2:$W$3450,2,FALSE)","v":"Bruant proyer"},{"$f":"'2-OISEAUX'!$A$18","v":"BRP"},{"$f":"VLOOKUP('compilation données pour export'!$R21,'listes valeurs'!$T$2:$W$3450,4,FALSE)","v":"Emberiza calandra                       "},{"$f":"VLOOKUP('compilation données pour export'!$R21,'listes valeurs'!$T$2:$W$3450,3,FALSE)","v":"Oiseaux"},"Nombre de territoires",{"$f":"IF(ISBLANK('2-OISEAUX'!$F$18),\"\",'2-OISEAUX'!$F$18)","v":""},"in",{"$f":"'Synthese Annuelle Monitoring'!$Q$19","v":0}]
[{"$f":"'0-INFOS GENERALES A REMPLIR'!$B$4","v":2021},{"$f":"'0-INFOS GENERALES A REMPLIR'!$B$6","v":0},{"$f":"IF(ISBLANK('0-INFOS GENERALES A REMPLIR'!$E$14),\"\",'0-INFOS GENERALES A REMPLIR'!$E$14)","v":""},{"$f":"IF(ISBLANK('0-INFOS GENERALES A REMPLIR'!$A$14),\"\",'0-INFOS GENERALES A REMPLIR'!$A$14)","v":""},{"$f":"IF(ISBLANK('0-INFOS GENERALES A REMPLIR'!$D$14),\"\",'0-INFOS GENERALES A REMPLIR'!$D$14)","v":""},{"$f":"IFERROR(INDEX('listes valeurs'!F$2:F$552,MATCH(1,('listes valeurs'!B$2:B$552=B22)*('listes valeurs'!E$2:E$552=D22),0)),\"\")","v":""},null,null,null,null,null,{"$f":"IF(ISBLANK('2-OISEAUX'!$I$9),\"\",'2-OISEAUX'!$I$9)","v":""},{"$f":"IF(ISBLANK('2-OISEAUX'!$I$10),\"\",'2-OISEAUX'!$I$10)","v":""},{"$f":"IF(ISBLANK('2-OISEAUX'!$J$10),\"\",'2-OISEAUX'!$J$10)","v":""},{"$f":"IF(ISBLANK('2-OISEAUX'!$I$13),\"\",'2-OISEAUX'!$I$13)","v":""},{"$f":"IF(ISBLANK('2-OISEAUX'!$I$8),\"\",'2-OISEAUX'!$I$8)","v":""},{"$f":"VLOOKUP('compilation données pour export'!$R22,'listes valeurs'!$T$2:$W$3450,2,FALSE)","v":"Bruant proyer"},{"$f":"'2-OISEAUX'!$A$18","v":"BRP"},{"$f":"VLOOKUP('compilation données pour export'!$R22,'listes valeurs'!$T$2:$W$3450,4,FALSE)","v":"Emberiza calandra                       "},{"$f":"VLOOKUP('compilation données pour export'!$R22,'listes valeurs'!$T$2:$W$3450,3,FALSE)","v":"Oiseaux"},"Nombre de territoires",{"$f":"IF(ISBLANK('2-OISEAUX'!$I18),\"\",'2-OISEAUX'!$I$18)","v":""},"in",{"$f":"'Synthese Annuelle Monitoring'!$Q$19","v":0}]
[{"$f":"'0-INFOS GENERALES A REMPLIR'!$B$4","v":2021},{"$f":"'0-INFOS GENERALES A REMPLIR'!$B$6","v":0},{"$f":"IF(ISBLANK('0-INFOS GENERALES A REMPLIR'!$E$15),\"\",'0-INFOS GENERALES A REMPLIR'!$E$15)","v":""},{"$f":"IF(ISBLANK('0-INFOS GENERALES A REMPLIR'!$A$15),\"\",'0-INFOS GENERALES A REMPLIR'!$A$15)","v":""},{"$f":"IF(ISBLANK('0-INFOS GENERALES A REMPLIR'!$D$15),\"\",'0-INFOS GENERALES A REMPLIR'!$D$15)","v":""},{"$f":"IFERROR(INDEX('listes valeurs'!F$2:F$552,MATCH(1,('listes valeurs'!B$2:B$552=B23)*('listes valeurs'!E$2:E$552=D23),0)),\"\")","v":""},null,null,null,null,null,{"$f":"IF(ISBLANK('2-OISEAUX'!$L$9),\"\",'2-OISEAUX'!$L$9)","v":""},{"$f":"IF(ISBLANK('2-OISEAUX'!$L$10),\"\",'2-OISEAUX'!$L$10)","v":""},{"$f":"IF(ISBLANK('2-OISEAUX'!$M$10),\"\",'2-OISEAUX'!$M$10)","v":""},{"$f":"IF(ISBLANK('2-OISEAUX'!$L$13),\"\",'2-OISEAUX'!$L$13)","v":""},{"$f":"IF(ISBLANK('2-OISEAUX'!$L$8),\"\",'2-OISEAUX'!$L$8)","v":""},{"$f":"VLOOKUP('compilation données pour export'!$R23,'listes valeurs'!$T$2:$W$3450,2,FALSE)","v":"Bruant proyer"},{"$f":"'2-OISEAUX'!$A$18","v":"BRP"},{"$f":"VLOOKUP('compilation données pour export'!$R23,'listes valeurs'!$T$2:$W$3450,4,FALSE)","v":"Emberiza calandra                       "},{"$f":"VLOOKUP('compilation données pour export'!$R23,'listes valeurs'!$T$2:$W$3450,3,FALSE)","v":"Oiseaux"},"Nombre de territoires",{"$f":"IF(ISBLANK('2-OISEAUX'!$L$18),\"\",'2-OISEAUX'!$L$18)","v":""},"in",{"$f":"'Synthese Annuelle Monitoring'!$Q$19","v":0}]
[{"$f":"'0-INFOS GENERALES A REMPLIR'!$B$4","v":2021},{"$f":"'0-INFOS GENERALES A REMPLIR'!$B$6","v":0},{"$f":"IF(ISBLANK('0-INFOS GENERALES A REMPLIR'!$E$16),\"\",'0-INFOS GENERALES A REMPLIR'!$E$16)","v":""},{"$f":"IF(ISBLANK('0-INFOS GENERALES A REMPLIR'!$A$16),\"\",'0-INFOS GENERALES A REMPLIR'!$A$16)","v":""},{"$f":"IF(ISBLANK('0-INFOS GENERALES A REMPLIR'!$D$16),\"\",'0-INFOS GENERALES A REMPLIR'!$D$16)","v":""},{"$f":"IFERROR(INDEX('listes valeurs'!F$2:F$552,MATCH(1,('listes valeurs'!B$2:B$552=B24)*('listes valeurs'!E$2:E$552=D24),0)),\"\")","v":""},null,null,null,null,null,{"$f":"IF(ISBLANK('2-OISEAUX'!$O$9),\"\",'2-OISEAUX'!$O$9)","v":""},{"$f":"IF(ISBLANK('2-OISEAUX'!$O$10),\"\",'2-OISEAUX'!$O$10)","v":""},{"$f":"IF(ISBLANK('2-OISEAUX'!$P$10),\"\",'2-OISEAUX'!$P$10)","v":""},{"$f":"IF(ISBLANK('2-OISEAUX'!$O$13),\"\",'2-OISEAUX'!$O$13)","v":""},{"$f":"IF(ISBLANK('2-OISEAUX'!$O$8),\"\",'2-OISEAUX'!$O$8)","v":""},{"$f":"VLOOKUP('compilation données pour export'!$R24,'listes valeurs'!$T$2:$W$3450,2,FALSE)","v":"Bruant proyer"},{"$f":"'2-OISEAUX'!$A$18","v":"BRP"},{"$f":"VLOOKUP('compilation données pour export'!$R24,'listes valeurs'!$T$2:$W$3450,4,FALSE)","v":"Emberiza calandra                       "},{"$f":"VLOOKUP('compilation données pour export'!$R24,'listes valeurs'!$T$2:$W$3450,3,FALSE)","v":"Oiseaux"},"Nombre de territoires",{"$f":"IF(ISBLANK('2-OISEAUX'!$O$18),\"\",'2-OISEAUX'!$O$18)","v":""},"in",{"$f":"'Synthese Annuelle Monitoring'!$Q$19","v":0}]
[{"$f":"'0-INFOS GENERALES A REMPLIR'!$B$4","v":2021},{"$f":"'0-INFOS GENERALES A REMPLIR'!$B$6","v":0},{"$f":"IF(ISBLANK('0-INFOS GENERALES A REMPLIR'!$E$12),\"\",'0-INFOS GENERALES A REMPLIR'!$E$12)","v":""},{"$f":"IF(ISBLANK('0-INFOS GENERALES A REMPLIR'!$A$12),\"\",'0-INFOS GENERALES A REMPLIR'!$A$12)","v":""},{"$f":"IF(ISBLANK('0-INFOS GENERALES A REMPLIR'!$D$12),\"\",'0-INFOS GENERALES A REMPLIR'!$D$12)","v":""},{"$f":"IFERROR(INDEX('listes valeurs'!F$2:F$552,MATCH(1,('listes valeurs'!B$2:B$552=B25)*('listes valeurs'!E$2:E$552=D25),0)),\"\")","v":""},null,null,null,null,null,{"$f":"IF(ISBLANK('2-OISEAUX'!$C$9),\"\",'2-OISEAUX'!$C$9)","v":""},{"$f":"IF(ISBLANK('2-OISEAUX'!$C$10),\"\",'2-OISEAUX'!$C$10)","v":""},{"$f":"IF(ISBLANK('2-OISEAUX'!$D$10),\"\",'2-OISEAUX'!$D$10)","v":""},{"$f":"IF(ISBLANK('2-OISEAUX'!$C$13),\"\",'2-OISEAUX'!$C$13)","v":""},{"$f":"IF(ISBLANK('2-OISEAUX'!$C$8),\"\",'2-OISEAUX'!$C$8)","v":""},{"$f":"VLOOKUP('compilation données pour export'!$R25,'listes valeurs'!$T$2:$W$3450,2,FALSE)","v":"Pie-grièche écorcheur"},{"$f":"'2-OISEAUX'!$A$19","v":"PGE"},{"$f":"VLOOKUP('compilation données pour export'!$R25,'listes valeurs'!$T$2:$W$3450,4,FALSE)","v":"Lanius collurio                         "},{"$f":"VLOOKUP('compilation données pour export'!$R25,'listes valeurs'!$T$2:$W$3450,3,FALSE)","v":"Oiseaux"},"Nombre de territoires",{"$f":"IF(ISBLANK('2-OISEAUX'!$C$19),\"\",'2-OISEAUX'!$C$19)","v":""},"in",{"$f":"'Synthese Annuelle Monitoring'!$Q$20","v":0}]
[{"$f":"'0-INFOS GENERALES A REMPLIR'!$B$4","v":2021},{"$f":"'0-INFOS GENERALES A REMPLIR'!$B$6","v":0},{"$f":"IF(ISBLANK('0-INFOS GENERALES A REMPLIR'!$E$13),\"\",'0-INFOS GENERALES A REMPLIR'!$E$13)","v":""},{"$f":"IF(ISBLANK('0-INFOS GENERALES A REMPLIR'!$A$13),\"\",'0-INFOS GENERALES A REMPLIR'!$A$13)","v":""},{"$f":"IF(ISBLANK('0-INFOS GENERALES A REMPLIR'!$D$13),\"\",'0-INFOS GENERALES A REMPLIR'!$D$13)","v":""},{"$f":"IFERROR(INDEX('listes valeurs'!F$2:F$552,MATCH(1,('listes valeurs'!B$2:B$552=B26)*('listes valeurs'!E$2:E$552=D26),0)),\"\")","v":""},null,null,null,null,null,{"$f":"IF(ISBLANK('2-OISEAUX'!$F$9),\"\",'2-OISEAUX'!$F$9)","v":""},{"$f":"IF(ISBLANK('2-OISEAUX'!$F$10),\"\",'2-OISEAUX'!$F$10)","v":""},{"$f":"IF(ISBLANK('2-OISEAUX'!$G$10),\"\",'2-OISEAUX'!$G$10)","v":""},{"$f":"IF(ISBLANK('2-OISEAUX'!$F$13),\"\",'2-OISEAUX'!$F$13)","v":""},{"$f":"IF(ISBLANK('2-OISEAUX'!$F$8),\"\",'2-OISEAUX'!$F$8)","v":""},{"$f":"VLOOKUP('compilation données pour export'!$R26,'listes valeurs'!$T$2:$W$3450,2,FALSE)","v":"Pie-grièche écorcheur"},{"$f":"'2-OISEAUX'!$A$19","v":"PGE"},{"$f":"VLOOKUP('compilation données pour export'!$R26,'listes valeurs'!$T$2:$W$3450,4,FALSE)","v":"Lanius collurio                         "},{"$f":"VLOOKUP('compilation données pour export'!$R26,'listes valeurs'!$T$2:$W$3450,3,FALSE)","v":"Oiseaux"},"Nombre de territoires",{"$f":"IF(ISBLANK('2-OISEAUX'!$F$19),\"\",'2-OISEAUX'!$F$19)","v":""},"in",{"$f":"'Synthese Annuelle Monitoring'!$Q$20","v":0}]
[{"$f":"'0-INFOS GENERALES A REMPLIR'!$B$4","v":2021},{"$f":"'0-INFOS GENERALES A REMPLIR'!$B$6","v":0},{"$f":"IF(ISBLANK('0-INFOS GENERALES A REMPLIR'!$E$14),\"\",'0-INFOS GENERALES A REMPLIR'!$E$14)","v":""},{"$f":"IF(ISBLANK('0-INFOS GENERALES A REMPLIR'!$A$14),\"\",'0-INFOS GENERALES A REMPLIR'!$A$14)","v":""},{"$f":"IF(ISBLANK('0-INFOS GENERALES A REMPLIR'!$D$14),\"\",'0-INFOS GENERALES A REMPLIR'!$D$14)","v":""},{"$f":"IFERROR(INDEX('listes valeurs'!F$2:F$552,MATCH(1,('listes valeurs'!B$2:B$552=B27)*('listes valeurs'!E$2:E$552=D27),0)),\"\")","v":""},null,null,null,null,null,{"$f":"IF(ISBLANK('2-OISEAUX'!$I$9),\"\",'2-OISEAUX'!$I$9)","v":""},{"$f":"IF(ISBLANK('2-OISEAUX'!$I$10),\"\",'2-OISEAUX'!$I$10)","v":""},{"$f":"IF(ISBLANK('2-OISEAUX'!$J$10),\"\",'2-OISEAUX'!$J$10)","v":""},{"$f":"IF(ISBLANK('2-OISEAUX'!$I$13),\"\",'2-OISEAUX'!$I$13)","v":""},{"$f":"IF(ISBLANK('2-OISEAUX'!$I$8),\"\",'2-OISEAUX'!$I$8)","v":""},{"$f":"VLOOKUP('compilation données pour export'!$R27,'listes valeurs'!$T$2:$W$3450,2,FALSE)","v":"Pie-grièche écorcheur"},{"$f":"'2-OISEAUX'!$A$19","v":"PGE"},{"$f":"VLOOKUP('compilation données pour export'!$R27,'listes valeurs'!$T$2:$W$3450,4,FALSE)","v":"Lanius collurio                         "},{"$f":"VLOOKUP('compilation données pour export'!$R27,'listes valeurs'!$T$2:$W$3450,3,FALSE)","v":"Oiseaux"},"Nombre de territoires",{"$f":"IF(ISBLANK('2-OISEAUX'!$I$19),\"\",'2-OISEAUX'!$I$19)","v":""},"in",{"$f":"'Synthese Annuelle Monitoring'!$Q$20","v":0}]
[{"$f":"'0-INFOS GENERALES A REMPLIR'!$B$4","v":2021},{"$f":"'0-INFOS GENERALES A REMPLIR'!$B$6","v":0},{"$f":"IF(ISBLANK('0-INFOS GENERALES A REMPLIR'!$E$15),\"\",'0-INFOS GENERALES A REMPLIR'!$E$15)","v":""},{"$f":"IF(ISBLANK('0-INFOS GENERALES A REMPLIR'!$A$15),\"\",'0-INFOS GENERALES A REMPLIR'!$A$15)","v":""},{"$f":"IF(ISBLANK('0-INFOS GENERALES A REMPLIR'!$D$15),\"\",'0-INFOS GENERALES A REMPLIR'!$D$15)","v":""},{"$f":"IFERROR(INDEX('listes valeurs'!F$2:F$552,MATCH(1,('listes valeurs'!B$2:B$552=B28)*('listes valeurs'!E$2:E$552=D28),0)),\"\")","v":""},null,null,null,null,null,{"$f":"IF(ISBLANK('2-OISEAUX'!$L$9),\"\",'2-OISEAUX'!$L$9)","v":""},{"$f":"IF(ISBLANK('2-OISEAUX'!$L$10),\"\",'2-OISEAUX'!$L$10)","v":""},{"$f":"IF(ISBLANK('2-OISEAUX'!$M$10),\"\",'2-OISEAUX'!$M$10)","v":""},{"$f":"IF(ISBLANK('2-OISEAUX'!$L$13),\"\",'2-OISEAUX'!$L$13)","v":""},{"$f":"IF(ISBLANK('2-OISEAUX'!$L$8),\"\",'2-OISEAUX'!$L$8)","v":""},{"$f":"VLOOKUP('compilation données pour export'!$R28,'listes valeurs'!$T$2:$W$3450,2,FALSE)","v":"Pie-grièche écorcheur"},{"$f":"'2-OISEAUX'!$A$19","v":"PGE"},{"$f":"VLOOKUP('compilation données pour export'!$R28,'listes valeurs'!$T$2:$W$3450,4,FALSE)","v":"Lanius collurio                         "},{"$f":"VLOOKUP('compilation données pour export'!$R28,'listes valeurs'!$T$2:$W$3450,3,FALSE)","v":"Oiseaux"},"Nombre de territoires",{"$f":"IF(ISBLANK('2-OISEAUX'!$L$19),\"\",'2-OISEAUX'!$L$19)","v":""},"in",{"$f":"'Synthese Annuelle Monitoring'!$Q$20","v":0}]
[{"$f":"'0-INFOS GENERALES A REMPLIR'!$B$4","v":2021},{"$f":"'0-INFOS GENERALES A REMPLIR'!$B$6","v":0},{"$f":"IF(ISBLANK('0-INFOS GENERALES A REMPLIR'!$E$16),\"\",'0-INFOS GENERALES A REMPLIR'!$E$16)","v":""},{"$f":"IF(ISBLANK('0-INFOS GENERALES A REMPLIR'!$A$16),\"\",'0-INFOS GENERALES A REMPLIR'!$A$16)","v":""},{"$f":"IF(ISBLANK('0-INFOS GENERALES A REMPLIR'!$D$16),\"\",'0-INFOS GENERALES A REMPLIR'!$D$16)","v":""},{"$f":"IFERROR(INDEX('listes valeurs'!F$2:F$552,MATCH(1,('listes valeurs'!B$2:B$552=B29)*('listes valeurs'!E$2:E$552=D29),0)),\"\")","v":""},null,null,null,null,null,{"$f":"IF(ISBLANK('2-OISEAUX'!$O$9),\"\",'2-OISEAUX'!$O$9)","v":""},{"$f":"IF(ISBLANK('2-OISEAUX'!$O$10),\"\",'2-OISEAUX'!$O$10)","v":""},{"$f":"IF(ISBLANK('2-OISEAUX'!$P$10),\"\",'2-OISEAUX'!$P$10)","v":""},{"$f":"IF(ISBLANK('2-OISEAUX'!$O$13),\"\",'2-OISEAUX'!$O$13)","v":""},{"$f":"IF(ISBLANK('2-OISEAUX'!$O$8),\"\",'2-OISEAUX'!$O$8)","v":""},{"$f":"VLOOKUP('compilation données pour export'!$R29,'listes valeurs'!$T$2:$W$3450,2,FALSE)","v":"Pie-grièche écorcheur"},{"$f":"'2-OISEAUX'!$A$19","v":"PGE"},{"$f":"VLOOKUP('compilation données pour export'!$R29,'listes valeurs'!$T$2:$W$3450,4,FALSE)","v":"Lanius collurio                         "},{"$f":"VLOOKUP('compilation données pour export'!$R29,'listes valeurs'!$T$2:$W$3450,3,FALSE)","v":"Oiseaux"},"Nombre de territoires",{"$f":"IF(ISBLANK('2-OISEAUX'!$O$19),\"\",'2-OISEAUX'!$O$19)","v":""},"in",{"$f":"'Synthese Annuelle Monitoring'!$Q$20","v":0}]
[{"$f":"'0-INFOS GENERALES A REMPLIR'!$B$4","v":2021},{"$f":"'0-INFOS GENERALES A REMPLIR'!$B$6","v":0},{"$f":"IF(ISBLANK('0-INFOS GENERALES A REMPLIR'!$E$12),\"\",'0-INFOS GENERALES A REMPLIR'!$E$12)","v":""},{"$f":"IF(ISBLANK('0-INFOS GENERALES A REMPLIR'!$A$12),\"\",'0-INFOS GENERALES A REMPLIR'!$A$12)","v":""},{"$f":"IF(ISBLANK('0-INFOS GENERALES A REMPLIR'!$D$12),\"\",'0-INFOS GENERALES A REMPLIR'!$D$12)","v":""},{"$f":"IFERROR(INDEX('listes valeurs'!F$2:F$552,MATCH(1,('listes valeurs'!B$2:B$552=B30)*('listes valeurs'!E$2:E$552=D30),0)),\"\")","v":""},null,null,null,null,null,{"$f":"IF(ISBLANK('2-OISEAUX'!$C$9),\"\",'2-OISEAUX'!$C$9)","v":""},{"$f":"IF(ISBLANK('2-OISEAUX'!$C$10),\"\",'2-OISEAUX'!$C$10)","v":""},{"$f":"IF(ISBLANK('2-OISEAUX'!$D$10),\"\",'2-OISEAUX'!$D$10)","v":""},{"$f":"IF(ISBLANK('2-OISEAUX'!$C$13),\"\",'2-OISEAUX'!$C$13)","v":""},{"$f":"IF(ISBLANK('2-OISEAUX'!$C$8),\"\",'2-OISEAUX'!$C$8)","v":""},{"$f":"VLOOKUP('compilation données pour export'!$R30,'listes valeurs'!$T$2:$W$3450,2,FALSE)","v":"Torcol fourmilier"},{"$f":"'2-OISEAUX'!$A$20","v":"TOR"},{"$f":"VLOOKUP('compilation données pour export'!$R30,'listes valeurs'!$T$2:$W$3450,4,FALSE)","v":"Jynx torquilla                          "},{"$f":"VLOOKUP('compilation données pour export'!$R30,'listes valeurs'!$T$2:$W$3450,3,FALSE)","v":"Oiseaux"},"Nombre de territoires",{"$f":"IF(ISBLANK('2-OISEAUX'!$C$20),\"\",'2-OISEAUX'!$C$20)","v":""},"in",{"$f":"'Synthese Annuelle Monitoring'!$Q$21","v":0}]
[{"$f":"'0-INFOS GENERALES A REMPLIR'!$B$4","v":2021},{"$f":"'0-INFOS GENERALES A REMPLIR'!$B$6","v":0},{"$f":"IF(ISBLANK('0-INFOS GENERALES A REMPLIR'!$E$13),\"\",'0-INFOS GENERALES A REMPLIR'!$E$13)","v":""},{"$f":"IF(ISBLANK('0-INFOS GENERALES A REMPLIR'!$A$13),\"\",'0-INFOS GENERALES A REMPLIR'!$A$13)","v":""},{"$f":"IF(ISBLANK('0-INFOS GENERALES A REMPLIR'!$D$13),\"\",'0-INFOS GENERALES A REMPLIR'!$D$13)","v":""},{"$f":"IFERROR(INDEX('listes valeurs'!F$2:F$552,MATCH(1,('listes valeurs'!B$2:B$552=B31)*('listes valeurs'!E$2:E$552=D31),0)),\"\")","v":""},null,null,null,null,null,{"$f":"IF(ISBLANK('2-OISEAUX'!$F$9),\"\",'2-OISEAUX'!$F$9)","v":""},{"$f":"IF(ISBLANK('2-OISEAUX'!$F$10),\"\",'2-OISEAUX'!$F$10)","v":""},{"$f":"IF(ISBLANK('2-OISEAUX'!$G$10),\"\",'2-OISEAUX'!$G$10)","v":""},{"$f":"IF(ISBLANK('2-OISEAUX'!$F$13),\"\",'2-OISEAUX'!$F$13)","v":""},{"$f":"IF(ISBLANK('2-OISEAUX'!$F$8),\"\",'2-OISEAUX'!$F$8)","v":""},{"$f":"VLOOKUP('compilation données pour export'!$R31,'listes valeurs'!$T$2:$W$3450,2,FALSE)","v":"Torcol fourmilier"},{"$f":"'2-OISEAUX'!$A$20","v":"TOR"},{"$f":"VLOOKUP('compilation données pour export'!$R31,'listes valeurs'!$T$2:$W$3450,4,FALSE)","v":"Jynx torquilla                          "},{"$f":"VLOOKUP('compilation données pour export'!$R31,'listes valeurs'!$T$2:$W$3450,3,FALSE)","v":"Oiseaux"},"Nombre de territoires",{"$f":"IF(ISBLANK('2-OISEAUX'!$F$20),\"\",'2-OISEAUX'!$F$20)","v":""},"in",{"$f":"'Synthese Annuelle Monitoring'!$Q$21","v":0}]
[{"$f":"'0-INFOS GENERALES A REMPLIR'!$B$4","v":2021},{"$f":"'0-INFOS GENERALES A REMPLIR'!$B$6","v":0},{"$f":"IF(ISBLANK('0-INFOS GENERALES A REMPLIR'!$E$14),\"\",'0-INFOS GENERALES A REMPLIR'!$E$14)","v":""},{"$f":"IF(ISBLANK('0-INFOS GENERALES A REMPLIR'!$A$14),\"\",'0-INFOS GENERALES A REMPLIR'!$A$14)","v":""},{"$f":"IF(ISBLANK('0-INFOS GENERALES A REMPLIR'!$D$14),\"\",'0-INFOS GENERALES A REMPLIR'!$D$14)","v":""},{"$f":"IFERROR(INDEX('listes valeurs'!F$2:F$552,MATCH(1,('listes valeurs'!B$2:B$552=B32)*('listes valeurs'!E$2:E$552=D32),0)),\"\")","v":""},null,null,null,null,null,{"$f":"IF(ISBLANK('2-OISEAUX'!$I$9),\"\",'2-OISEAUX'!$I$9)","v":""},{"$f":"IF(ISBLANK('2-OISEAUX'!$I$10),\"\",'2-OISEAUX'!$I$10)","v":""},{"$f":"IF(ISBLANK('2-OISEAUX'!$J$10),\"\",'2-OISEAUX'!$J$10)","v":""},{"$f":"IF(ISBLANK('2-OISEAUX'!$I$13),\"\",'2-OISEAUX'!$I$13)","v":""},{"$f":"IF(ISBLANK('2-OISEAUX'!$I$8),\"\",'2-OISEAUX'!$I$8)","v":""},{"$f":"VLOOKUP('compilation données pour export'!$R32,'listes valeurs'!$T$2:$W$3450,2,FALSE)","v":"Torcol fourmilier"},{"$f":"'2-OISEAUX'!$A$20","v":"TOR"},{"$f":"VLOOKUP('compilation données pour export'!$R32,'listes valeurs'!$T$2:$W$3450,4,FALSE)","v":"Jynx torquilla                          "},{"$f":"VLOOKUP('compilation données pour export'!$R32,'listes valeurs'!$T$2:$W$3450,3,FALSE)","v":"Oiseaux"},"Nombre de territoires",{"$f":"IF(ISBLANK('2-OISEAUX'!$I$20),\"\",'2-OISEAUX'!$I$20)","v":""},"in",{"$f":"'Synthese Annuelle Monitoring'!$Q$21","v":0}]
[{"$f":"'0-INFOS GENERALES A REMPLIR'!$B$4","v":2021},{"$f":"'0-INFOS GENERALES A REMPLIR'!$B$6","v":0},{"$f":"IF(ISBLANK('0-INFOS GENERALES A REMPLIR'!$E$15),\"\",'0-INFOS GENERALES A REMPLIR'!$E$15)","v":""},{"$f":"IF(ISBLANK('0-INFOS GENERALES A REMPLIR'!$A$15),\"\",'0-INFOS GENERALES A REMPLIR'!$A$15)","v":""},{"$f":"IF(ISBLANK('0-INFOS GENERALES A REMPLIR'!$D$15),\"\",'0-INFOS GENERALES A REMPLIR'!$D$15)","v":""},{"$f":"IFERROR(INDEX('listes valeurs'!F$2:F$552,MATCH(1,('listes valeurs'!B$2:B$552=B33)*('listes valeurs'!E$2:E$552=D33),0)),\"\")","v":""},null,null,null,null,null,{"$f":"IF(ISBLANK('2-OISEAUX'!$L$9),\"\",'2-OISEAUX'!$L$9)","v":""},{"$f":"IF(ISBLANK('2-OISEAUX'!$L$10),\"\",'2-OISEAUX'!$L$10)","v":""},{"$f":"IF(ISBLANK('2-OISEAUX'!$M$10),\"\",'2-OISEAUX'!$M$10)","v":""},{"$f":"IF(ISBLANK('2-OISEAUX'!$L$13),\"\",'2-OISEAUX'!$L$13)","v":""},{"$f":"IF(ISBLANK('2-OISEAUX'!$L$8),\"\",'2-OISEAUX'!$L$8)","v":""},{"$f":"VLOOKUP('compilation données pour export'!$R33,'listes valeurs'!$T$2:$W$3450,2,FALSE)","v":"Torcol fourmilier"},{"$f":"'2-OISEAUX'!$A$20","v":"TOR"},{"$f":"VLOOKUP('compilation données pour export'!$R33,'listes valeurs'!$T$2:$W$3450,4,FALSE)","v":"Jynx torquilla                          "},{"$f":"VLOOKUP('compilation données pour export'!$R33,'listes valeurs'!$T$2:$W$3450,3,FALSE)","v":"Oiseaux"},"Nombre de territoires",{"$f":"IF(ISBLANK('2-OISEAUX'!$L$20),\"\",'2-OISEAUX'!$L$20)","v":""},"in",{"$f":"'Synthese Annuelle Monitoring'!$Q$21","v":0}]
[{"$f":"'0-INFOS GENERALES A REMPLIR'!$B$4","v":2021},{"$f":"'0-INFOS GENERALES A REMPLIR'!$B$6","v":0},{"$f":"IF(ISBLANK('0-INFOS GENERALES A REMPLIR'!$E$16),\"\",'0-INFOS GENERALES A REMPLIR'!$E$16)","v":""},{"$f":"IF(ISBLANK('0-INFOS GENERALES A REMPLIR'!$A$16),\"\",'0-INFOS GENERALES A REMPLIR'!$A$16)","v":""},{"$f":"IF(ISBLANK('0-INFOS GENERALES A REMPLIR'!$D$16),\"\",'0-INFOS GENERALES A REMPLIR'!$D$16)","v":""},{"$f":"IFERROR(INDEX('listes valeurs'!F$2:F$552,MATCH(1,('listes valeurs'!B$2:B$552=B34)*('listes valeurs'!E$2:E$552=D34),0)),\"\")","v":""},null,null,null,null,null,{"$f":"IF(ISBLANK('2-OISEAUX'!$O$9),\"\",'2-OISEAUX'!$O$9)","v":""},{"$f":"IF(ISBLANK('2-OISEAUX'!$O$10),\"\",'2-OISEAUX'!$O$10)","v":""},{"$f":"IF(ISBLANK('2-OISEAUX'!$P$10),\"\",'2-OISEAUX'!$P$10)","v":""},{"$f":"IF(ISBLANK('2-OISEAUX'!$O$13),\"\",'2-OISEAUX'!$O$13)","v":""},{"$f":"IF(ISBLANK('2-OISEAUX'!$O$8),\"\",'2-OISEAUX'!$O$8)","v":""},{"$f":"VLOOKUP('compilation données pour export'!$R34,'listes valeurs'!$T$2:$W$3450,2,FALSE)","v":"Torcol fourmilier"},{"$f":"'2-OISEAUX'!$A$20","v":"TOR"},{"$f":"VLOOKUP('compilation données pour export'!$R34,'listes valeurs'!$T$2:$W$3450,4,FALSE)","v":"Jynx torquilla                          "},{"$f":"VLOOKUP('compilation données pour export'!$R34,'listes valeurs'!$T$2:$W$3450,3,FALSE)","v":"Oiseaux"},"Nombre de territoires",{"$f":"IF(ISBLANK('2-OISEAUX'!$O$20),\"\",'2-OISEAUX'!$O$20)","v":""},"in",{"$f":"'Synthese Annuelle Monitoring'!$Q$21","v":0}]
[{"$f":"'0-INFOS GENERALES A REMPLIR'!$B$4","v":2021},{"$f":"'0-INFOS GENERALES A REMPLIR'!$B$6","v":0},{"$f":"IF(ISBLANK('0-INFOS GENERALES A REMPLIR'!$E$12),\"\",'0-INFOS GENERALES A REMPLIR'!$E$12)","v":""},{"$f":"IF(ISBLANK('0-INFOS GENERALES A REMPLIR'!$A$12),\"\",'0-INFOS GENERALES A REMPLIR'!$A$12)","v":""},{"$f":"IF(ISBLANK('0-INFOS GENERALES A REMPLIR'!$D$12),\"\",'0-INFOS GENERALES A REMPLIR'!$D$12)","v":""},{"$f":"IFERROR(INDEX('listes valeurs'!F$2:F$552,MATCH(1,('listes valeurs'!B$2:B$552=B35)*('listes valeurs'!E$2:E$552=D35),0)),\"\")","v":""},null,null,null,null,null,{"$f":"IF(ISBLANK('2-OISEAUX'!$C$9),\"\",'2-OISEAUX'!$C$9)","v":""},{"$f":"IF(ISBLANK('2-OISEAUX'!$C$10),\"\",'2-OISEAUX'!$C$10)","v":""},{"$f":"IF(ISBLANK('2-OISEAUX'!$D$10),\"\",'2-OISEAUX'!$D$10)","v":""},{"$f":"IF(ISBLANK('2-OISEAUX'!$C$13),\"\",'2-OISEAUX'!$C$13)","v":""},{"$f":"IF(ISBLANK('2-OISEAUX'!$C$8),\"\",'2-OISEAUX'!$C$8)","v":""},{"$f":"VLOOKUP('compilation données pour export'!$R35,'listes valeurs'!$T$2:$W$3450,2,FALSE)","v":"Tarier des prés"},{"$f":"'2-OISEAUX'!$A$21","v":"TDP"},{"$f":"VLOOKUP('compilation données pour export'!$R35,'listes valeurs'!$T$2:$W$3450,4,FALSE)","v":"Saxicola rubetra                        "},{"$f":"VLOOKUP('compilation données pour export'!$R35,'listes valeurs'!$T$2:$W$3450,3,FALSE)","v":"Oiseaux"},"Nombre de territoires",{"$f":"IF(ISBLANK('2-OISEAUX'!$C$21),\"\",'2-OISEAUX'!$C$21)","v":""},"in",{"$f":"'Synthese Annuelle Monitoring'!$Q$22","v":0}]
[{"$f":"'0-INFOS GENERALES A REMPLIR'!$B$4","v":2021},{"$f":"'0-INFOS GENERALES A REMPLIR'!$B$6","v":0},{"$f":"IF(ISBLANK('0-INFOS GENERALES A REMPLIR'!$E$13),\"\",'0-INFOS GENERALES A REMPLIR'!$E$13)","v":""},{"$f":"IF(ISBLANK('0-INFOS GENERALES A REMPLIR'!$A$13),\"\",'0-INFOS GENERALES A REMPLIR'!$A$13)","v":""},{"$f":"IF(ISBLANK('0-INFOS GENERALES A REMPLIR'!$D$13),\"\",'0-INFOS GENERALES A REMPLIR'!$D$13)","v":""},{"$f":"IFERROR(INDEX('listes valeurs'!F$2:F$552,MATCH(1,('listes valeurs'!B$2:B$552=B36)*('listes valeurs'!E$2:E$552=D36),0)),\"\")","v":""},null,null,null,null,null,{"$f":"IF(ISBLANK('2-OISEAUX'!$F$9),\"\",'2-OISEAUX'!$F$9)","v":""},{"$f":"IF(ISBLANK('2-OISEAUX'!$F$10),\"\",'2-OISEAUX'!$F$10)","v":""},{"$f":"IF(ISBLANK('2-OISEAUX'!$G$10),\"\",'2-OISEAUX'!$G$10)","v":""},{"$f":"IF(ISBLANK('2-OISEAUX'!$F$13),\"\",'2-OISEAUX'!$F$13)","v":""},{"$f":"IF(ISBLANK('2-OISEAUX'!$F$8),\"\",'2-OISEAUX'!$F$8)","v":""},{"$f":"VLOOKUP('compilation données pour export'!$R36,'listes valeurs'!$T$2:$W$3450,2,FALSE)","v":"Tarier des prés"},{"$f":"'2-OISEAUX'!$A$21","v":"TDP"},{"$f":"VLOOKUP('compilation données pour export'!$R36,'listes valeurs'!$T$2:$W$3450,4,FALSE)","v":"Saxicola rubetra                        "},{"$f":"VLOOKUP('compilation données pour export'!$R36,'listes valeurs'!$T$2:$W$3450,3,FALSE)","v":"Oiseaux"},"Nombre de territoires",{"$f":"IF(ISBLANK('2-OISEAUX'!$F$21),\"\",'2-OISEAUX'!$F$21)","v":""},"in",{"$f":"'Synthese Annuelle Monitoring'!$Q$22","v":0}]
[{"$f":"'0-INFOS GENERALES A REMPLIR'!$B$4","v":2021},{"$f":"'0-INFOS GENERALES A REMPLIR'!$B$6","v":0},{"$f":"IF(ISBLANK('0-INFOS GENERALES A REMPLIR'!$E$14),\"\",'0-INFOS GENERALES A REMPLIR'!$E$14)","v":""},{"$f":"IF(ISBLANK('0-INFOS GENERALES A REMPLIR'!$A$14),\"\",'0-INFOS GENERALES A REMPLIR'!$A$14)","v":""},{"$f":"IF(ISBLANK('0-INFOS GENERALES A REMPLIR'!$D$14),\"\",'0-INFOS GENERALES A REMPLIR'!$D$14)","v":""},{"$f":"IFERROR(INDEX('listes valeurs'!F$2:F$552,MATCH(1,('listes valeurs'!B$2:B$552=B37)*('listes valeurs'!E$2:E$552=D37),0)),\"\")","v":""},null,null,null,null,null,{"$f":"IF(ISBLANK('2-OISEAUX'!$I$9),\"\",'2-OISEAUX'!$I$9)","v":""},{"$f":"IF(ISBLANK('2-OISEAUX'!$I$10),\"\",'2-OISEAUX'!$I$10)","v":""},{"$f":"IF(ISBLANK('2-OISEAUX'!$J$10),\"\",'2-OISEAUX'!$J$10)","v":""},null,{"$f":"IF(ISBLANK('2-OISEAUX'!$I$8),\"\",'2-OISEAUX'!$I$8)","v":""},{"$f":"VLOOKUP('compilation données pour export'!$R37,'listes valeurs'!$T$2:$W$3450,2,FALSE)","v":"Tarier des prés"},{"$f":"'2-OISEAUX'!$A$21","v":"TDP"},{"$f":"VLOOKUP('compilation données pour export'!$R37,'listes valeurs'!$T$2:$W$3450,4,FALSE)","v":"Saxicola rubetra                        "},{"$f":"VLOOKUP('compilation données pour export'!$R37,'listes valeurs'!$T$2:$W$3450,3,FALSE)","v":"Oiseaux"},"Nombre de territoires",{"$f":"IF(ISBLANK('2-OISEAUX'!$I$21),\"\",'2-OISEAUX'!$I$21)","v":""},"in",{"$f":"'Synthese Annuelle Monitoring'!$Q$22","v":0}]
[{"$f":"'0-INFOS GENERALES A REMPLIR'!$B$4","v":2021},{"$f":"'0-INFOS GENERALES A REMPLIR'!$B$6","v":0},{"$f":"IF(ISBLANK('0-INFOS GENERALES A REMPLIR'!$E$15),\"\",'0-INFOS GENERALES A REMPLIR'!$E$15)","v":""},{"$f":"IF(ISBLANK('0-INFOS GENERALES A REMPLIR'!$A$15),\"\",'0-INFOS GENERALES A REMPLIR'!$A$15)","v":""},{"$f":"IF(ISBLANK('0-INFOS GENERALES A REMPLIR'!$D$15),\"\",'0-INFOS GENERALES A REMPLIR'!$D$15)","v":""},{"$f":"IFERROR(INDEX('listes valeurs'!F$2:F$552,MATCH(1,('listes valeurs'!B$2:B$552=B38)*('listes valeurs'!E$2:E$552=D38),0)),\"\")","v":""},null,null,null,null,null,{"$f":"IF(ISBLANK('2-OISEAUX'!$L$9),\"\",'2-OISEAUX'!$L$9)","v":""},{"$f":"IF(ISBLANK('2-OISEAUX'!$L$10),\"\",'2-OISEAUX'!$L$10)","v":""},{"$f":"IF(ISBLANK('2-OISEAUX'!$M$10),\"\",'2-OISEAUX'!$M$10)","v":""},{"$f":"IF(ISBLANK('2-OISEAUX'!$L$13),\"\",'2-OISEAUX'!$L$13)","v":""},{"$f":"IF(ISBLANK('2-OISEAUX'!$L$8),\"\",'2-OISEAUX'!$L$8)","v":""},{"$f":"VLOOKUP('compilation données pour export'!$R38,'listes valeurs'!$T$2:$W$3450,2,FALSE)","v":"Tarier des prés"},{"$f":"'2-OISEAUX'!$A$21","v":"TDP"},{"$f":"VLOOKUP('compilation données pour export'!$R38,'listes valeurs'!$T$2:$W$3450,4,FALSE)","v":"Saxicola rubetra                        "},{"$f":"VLOOKUP('compilation données pour export'!$R38,'listes valeurs'!$T$2:$W$3450,3,FALSE)","v":"Oiseaux"},"Nombre de territoires",{"$f":"IF(ISBLANK('2-OISEAUX'!$L$21),\"\",'2-OISEAUX'!$L$21)","v":""},"in",{"$f":"'Synthese Annuelle Monitoring'!$Q$22","v":0}]
[{"$f":"'0-INFOS GENERALES A REMPLIR'!$B$4","v":2021},{"$f":"'0-INFOS GENERALES A REMPLIR'!$B$6","v":0},{"$f":"IF(ISBLANK('0-INFOS GENERALES A REMPLIR'!$E$16),\"\",'0-INFOS GENERALES A REMPLIR'!$E$16)","v":""},{"$f":"IF(ISBLANK('0-INFOS GENERALES A REMPLIR'!$A$16),\"\",'0-INFOS GENERALES A REMPLIR'!$A$16)","v":""},{"$f":"IF(ISBLANK('0-INFOS GENERALES A REMPLIR'!$D$16),\"\",'0-INFOS GENERALES A REMPLIR'!$D$16)","v":""},{"$f":"IFERROR(INDEX('listes valeurs'!F$2:F$552,MATCH(1,('listes valeurs'!B$2:B$552=B39)*('listes valeurs'!E$2:E$552=D39),0)),\"\")","v":""},null,null,null,null,null,{"$f":"IF(ISBLANK('2-OISEAUX'!$O$9),\"\",'2-OISEAUX'!$O$9)","v":""},{"$f":"IF(ISBLANK('2-OISEAUX'!$O$10),\"\",'2-OISEAUX'!$O$10)","v":""},{"$f":"IF(ISBLANK('2-OISEAUX'!$P$10),\"\",'2-OISEAUX'!$P$10)","v":""},{"$f":"IF(ISBLANK('2-OISEAUX'!$O$13),\"\",'2-OISEAUX'!$O$13)","v":""},{"$f":"IF(ISBLANK('2-OISEAUX'!$O$8),\"\",'2-OISEAUX'!$O$8)","v":""},{"$f":"VLOOKUP('compilation données pour export'!$R39,'listes valeurs'!$T$2:$W$3450,2,FALSE)","v":"Tarier des prés"},{"$f":"'2-OISEAUX'!$A$21","v":"TDP"},{"$f":"VLOOKUP('compilation données pour export'!$R39,'listes valeurs'!$T$2:$W$3450,4,FALSE)","v":"Saxicola rubetra                        "},{"$f":"VLOOKUP('compilation données pour export'!$R39,'listes valeurs'!$T$2:$W$3450,3,FALSE)","v":"Oiseaux"},"Nombre de territoires",{"$f":"IF(ISBLANK('2-OISEAUX'!$O$21),\"\",'2-OISEAUX'!$O$21)","v":""},"in",{"$f":"'Synthese Annuelle Monitoring'!$Q$22","v":0}]
[{"$f":"'0-INFOS GENERALES A REMPLIR'!$B$4","v":2021},{"$f":"'0-INFOS GENERALES A REMPLIR'!$B$6","v":0},{"$f":"IF(ISBLANK('0-INFOS GENERALES A REMPLIR'!$E$12),\"\",'0-INFOS GENERALES A REMPLIR'!$E$12)","v":""},{"$f":"IF(ISBLANK('0-INFOS GENERALES A REMPLIR'!$A$12),\"\",'0-INFOS GENERALES A REMPLIR'!$A$12)","v":""},{"$f":"IF(ISBLANK('0-INFOS GENERALES A REMPLIR'!$D$12),\"\",'0-INFOS GENERALES A REMPLIR'!$D$12)","v":""},{"$f":"IFERROR(INDEX('listes valeurs'!F$2:F$552,MATCH(1,('listes valeurs'!B$2:B$552=B40)*('listes valeurs'!E$2:E$552=D40),0)),\"\")","v":""},null,null,null,null,null,{"$f":"IF(ISBLANK('2-OISEAUX'!$C$9),\"\",'2-OISEAUX'!$C$9)","v":""},{"$f":"IF(ISBLANK('2-OISEAUX'!$C$10),\"\",'2-OISEAUX'!$C$10)","v":""},{"$f":"IF(ISBLANK('2-OISEAUX'!$D$10),\"\",'2-OISEAUX'!$D$10)","v":""},{"$f":"IF(ISBLANK('2-OISEAUX'!$C$13),\"\",'2-OISEAUX'!$C$13)","v":""},{"$f":"IF(ISBLANK('2-OISEAUX'!$C$8),\"\",'2-OISEAUX'!$C$8)","v":""},{"$f":"VLOOKUP('compilation données pour export'!$R40,'listes valeurs'!$T$2:$W$3450,2,FALSE)","v":"Tarier pâtre"},{"$f":"'2-OISEAUX'!$A$22","v":"TPA"},{"$f":"VLOOKUP('compilation données pour export'!$R40,'listes valeurs'!$T$2:$W$3450,4,FALSE)","v":"Saxicola rubicola"},{"$f":"VLOOKUP('compilation données pour export'!$R40,'listes valeurs'!$T$2:$W$3450,3,FALSE)","v":"Oiseaux"},"Nombre de territoires",{"$f":"IF(ISBLANK('2-OISEAUX'!$C$22),\"\",'2-OISEAUX'!$C$22)","v":""},"in",{"$f":"'Synthese Annuelle Monitoring'!$Q$23","v":0}]
[{"$f":"'0-INFOS GENERALES A REMPLIR'!$B$4","v":2021},{"$f":"'0-INFOS GENERALES A REMPLIR'!$B$6","v":0},{"$f":"IF(ISBLANK('0-INFOS GENERALES A REMPLIR'!$E$13),\"\",'0-INFOS GENERALES A REMPLIR'!$E$13)","v":""},{"$f":"IF(ISBLANK('0-INFOS GENERALES A REMPLIR'!$A$13),\"\",'0-INFOS GENERALES A REMPLIR'!$A$13)","v":""},{"$f":"IF(ISBLANK('0-INFOS GENERALES A REMPLIR'!$D$13),\"\",'0-INFOS GENERALES A REMPLIR'!$D$13)","v":""},{"$f":"IFERROR(INDEX('listes valeurs'!F$2:F$552,MATCH(1,('listes valeurs'!B$2:B$552=B41)*('listes valeurs'!E$2:E$552=D41),0)),\"\")","v":""},null,null,null,null,null,{"$f":"IF(ISBLANK('2-OISEAUX'!$F$9),\"\",'2-OISEAUX'!$F$9)","v":""},{"$f":"IF(ISBLANK('2-OISEAUX'!$F$10),\"\",'2-OISEAUX'!$F$10)","v":""},{"$f":"IF(ISBLANK('2-OISEAUX'!$G$10),\"\",'2-OISEAUX'!$G$10)","v":""},{"$f":"IF(ISBLANK('2-OISEAUX'!$F$13),\"\",'2-OISEAUX'!$F$13)","v":""},{"$f":"IF(ISBLANK('2-OISEAUX'!$F$8),\"\",'2-OISEAUX'!$F$8)","v":""},{"$f":"VLOOKUP('compilation données pour export'!$R41,'listes valeurs'!$T$2:$W$3450,2,FALSE)","v":"Tarier pâtre"},{"$f":"'2-OISEAUX'!$A$22","v":"TPA"},{"$f":"VLOOKUP('compilation données pour export'!$R41,'listes valeurs'!$T$2:$W$3450,4,FALSE)","v":"Saxicola rubicola"},{"$f":"VLOOKUP('compilation données pour export'!$R41,'listes valeurs'!$T$2:$W$3450,3,FALSE)","v":"Oiseaux"},"Nombre de territoires",{"$f":"IF(ISBLANK('2-OISEAUX'!$F$22),\"\",'2-OISEAUX'!$F$22)","v":""},"in",{"$f":"'Synthese Annuelle Monitoring'!$Q$23","v":0}]
[{"$f":"'0-INFOS GENERALES A REMPLIR'!$B$4","v":2021},{"$f":"'0-INFOS GENERALES A REMPLIR'!$B$6","v":0},{"$f":"IF(ISBLANK('0-INFOS GENERALES A REMPLIR'!$E$14),\"\",'0-INFOS GENERALES A REMPLIR'!$E$14)","v":""},{"$f":"IF(ISBLANK('0-INFOS GENERALES A REMPLIR'!$A$14),\"\",'0-INFOS GENERALES A REMPLIR'!$A$14)","v":""},{"$f":"IF(ISBLANK('0-INFOS GENERALES A REMPLIR'!$D$14),\"\",'0-INFOS GENERALES A REMPLIR'!$D$14)","v":""},{"$f":"IFERROR(INDEX('listes valeurs'!F$2:F$552,MATCH(1,('listes valeurs'!B$2:B$552=B42)*('listes valeurs'!E$2:E$552=D42),0)),\"\")","v":""},null,null,null,null,null,{"$f":"IF(ISBLANK('2-OISEAUX'!$I$9),\"\",'2-OISEAUX'!$I$9)","v":""},{"$f":"IF(ISBLANK('2-OISEAUX'!$I$10),\"\",'2-OISEAUX'!$I$10)","v":""},{"$f":"IF(ISBLANK('2-OISEAUX'!$J$10),\"\",'2-OISEAUX'!$J$10)","v":""},{"$f":"IF(ISBLANK('2-OISEAUX'!$I$13),\"\",'2-OISEAUX'!$I$13)","v":""},{"$f":"IF(ISBLANK('2-OISEAUX'!$I$8),\"\",'2-OISEAUX'!$I$8)","v":""},{"$f":"VLOOKUP('compilation données pour export'!$R42,'listes valeurs'!$T$2:$W$3450,2,FALSE)","v":"Tarier pâtre"},{"$f":"'2-OISEAUX'!$A$22","v":"TPA"},{"$f":"VLOOKUP('compilation données pour export'!$R42,'listes valeurs'!$T$2:$W$3450,4,FALSE)","v":"Saxicola rubicola"},{"$f":"VLOOKUP('compilation données pour export'!$R42,'listes valeurs'!$T$2:$W$3450,3,FALSE)","v":"Oiseaux"},"Nombre de territoires",{"$f":"IF(ISBLANK('2-OISEAUX'!$I$22),\"\",'2-OISEAUX'!$I$22)","v":""},"in",{"$f":"'Synthese Annuelle Monitoring'!$Q$23","v":0}]
[{"$f":"'0-INFOS GENERALES A REMPLIR'!$B$4","v":2021},{"$f":"'0-INFOS GENERALES A REMPLIR'!$B$6","v":0},{"$f":"IF(ISBLANK('0-INFOS GENERALES A REMPLIR'!$E$15),\"\",'0-INFOS GENERALES A REMPLIR'!$E$15)","v":""},{"$f":"IF(ISBLANK('0-INFOS GENERALES A REMPLIR'!$A$15),\"\",'0-INFOS GENERALES A REMPLIR'!$A$15)","v":""},{"$f":"IF(ISBLANK('0-INFOS GENERALES A REMPLIR'!$D$15),\"\",'0-INFOS GENERALES A REMPLIR'!$D$15)","v":""},{"$f":"IFERROR(INDEX('listes valeurs'!F$2:F$552,MATCH(1,('listes valeurs'!B$2:B$552=B43)*('listes valeurs'!E$2:E$552=D43),0)),\"\")","v":""},null,null,null,null,null,{"$f":"IF(ISBLANK('2-OISEAUX'!$L$9),\"\",'2-OISEAUX'!$L$9)","v":""},{"$f":"IF(ISBLANK('2-OISEAUX'!$L$10),\"\",'2-OISEAUX'!$L$10)","v":""},{"$f":"IF(ISBLANK('2-OISEAUX'!$M$10),\"\",'2-OISEAUX'!$M$10)","v":""},{"$f":"IF(ISBLANK('2-OISEAUX'!$L$13),\"\",'2-OISEAUX'!$L$13)","v":""},{"$f":"IF(ISBLANK('2-OISEAUX'!$L$8),\"\",'2-OISEAUX'!$L$8)","v":""},{"$f":"VLOOKUP('compilation données pour export'!$R43,'listes valeurs'!$T$2:$W$3450,2,FALSE)","v":"Tarier pâtre"},{"$f":"'2-OISEAUX'!$A$22","v":"TPA"},{"$f":"VLOOKUP('compilation données pour export'!$R43,'listes valeurs'!$T$2:$W$3450,4,FALSE)","v":"Saxicola rubicola"},{"$f":"VLOOKUP('compilation données pour export'!$R43,'listes valeurs'!$T$2:$W$3450,3,FALSE)","v":"Oiseaux"},"Nombre de territoires",{"$f":"IF(ISBLANK('2-OISEAUX'!$L$22),\"\",'2-OISEAUX'!$L$22)","v":""},"in",{"$f":"'Synthese Annuelle Monitoring'!$Q$23","v":0}]
[{"$f":"'0-INFOS GENERALES A REMPLIR'!$B$4","v":2021},{"$f":"'0-INFOS GENERALES A REMPLIR'!$B$6","v":0},{"$f":"IF(ISBLANK('0-INFOS GENERALES A REMPLIR'!$E$16),\"\",'0-INFOS GENERALES A REMPLIR'!$E$16)","v":""},{"$f":"IF(ISBLANK('0-INFOS GENERALES A REMPLIR'!$A$16),\"\",'0-INFOS GENERALES A REMPLIR'!$A$16)","v":""},{"$f":"IF(ISBLANK('0-INFOS GENERALES A REMPLIR'!$D$16),\"\",'0-INFOS GENERALES A REMPLIR'!$D$16)","v":""},{"$f":"IFERROR(INDEX('listes valeurs'!F$2:F$552,MATCH(1,('listes valeurs'!B$2:B$552=B44)*('listes valeurs'!E$2:E$552=D44),0)),\"\")","v":""},null,null,null,null,null,{"$f":"IF(ISBLANK('2-OISEAUX'!$O$9),\"\",'2-OISEAUX'!$O$9)","v":""},{"$f":"IF(ISBLANK('2-OISEAUX'!$O$10),\"\",'2-OISEAUX'!$O$10)","v":""},{"$f":"IF(ISBLANK('2-OISEAUX'!$P$10),\"\",'2-OISEAUX'!$P$10)","v":""},{"$f":"IF(ISBLANK('2-OISEAUX'!$O$13),\"\",'2-OISEAUX'!$O$13)","v":""},{"$f":"IF(ISBLANK('2-OISEAUX'!$O$8),\"\",'2-OISEAUX'!$O$8)","v":""},{"$f":"VLOOKUP('compilation données pour export'!$R44,'listes valeurs'!$T$2:$W$3450,2,FALSE)","v":"Tarier pâtre"},{"$f":"'2-OISEAUX'!$A$22","v":"TPA"},{"$f":"VLOOKUP('compilation données pour export'!$R44,'listes valeurs'!$T$2:$W$3450,4,FALSE)","v":"Saxicola rubicola"},{"$f":"VLOOKUP('compilation données pour export'!$R44,'listes valeurs'!$T$2:$W$3450,3,FALSE)","v":"Oiseaux"},"Nombre de territoires",{"$f":"IF(ISBLANK('2-OISEAUX'!$O$22),\"\",'2-OISEAUX'!$O$22)","v":""},"in",{"$f":"'Synthese Annuelle Monitoring'!$Q$23","v":0}]
[{"$f":"'0-INFOS GENERALES A REMPLIR'!$B$4","v":2021},{"$f":"'0-INFOS GENERALES A REMPLIR'!$B$6","v":0},{"$f":"IF(ISBLANK('0-INFOS GENERALES A REMPLIR'!$E$12),\"\",'0-INFOS GENERALES A REMPLIR'!$E$12)","v":""},{"$f":"IF(ISBLANK('0-INFOS GENERALES A REMPLIR'!$A$12),\"\",'0-INFOS GENERALES A REMPLIR'!$A$12)","v":""},{"$f":"IF(ISBLANK('0-INFOS GENERALES A REMPLIR'!$D$12),\"\",'0-INFOS GENERALES A REMPLIR'!$D$12)","v":""},{"$f":"IFERROR(INDEX('listes valeurs'!F$2:F$552,MATCH(1,('listes valeurs'!B$2:B$552=B45)*('listes valeurs'!E$2:E$552=D45),0)),\"\")","v":""},null,null,null,null,null,{"$f":"IF(ISBLANK('2-OISEAUX'!$C$9),\"\",'2-OISEAUX'!$C$9)","v":""},{"$f":"IF(ISBLANK('2-OISEAUX'!$C$10),\"\",'2-OISEAUX'!$C$10)","v":""},{"$f":"IF(ISBLANK('2-OISEAUX'!$D$10),\"\",'2-OISEAUX'!$D$10)","v":""},{"$f":"IF(ISBLANK('2-OISEAUX'!$C$13),\"\",'2-OISEAUX'!$C$13)","v":""},{"$f":"IF(ISBLANK('2-OISEAUX'!$C$8),\"\",'2-OISEAUX'!$C$8)","v":""},{"$f":"VLOOKUP('compilation données pour export'!$R45,'listes valeurs'!$T$2:$W$3450,2,FALSE)","v":{"$error":"#N/A"}},{"$f":"IF(ISBLANK('2-OISEAUX'!$A$23),\"\",'2-OISEAUX'!$A$23)","v":""},{"$f":"VLOOKUP('compilation données pour export'!$R45,'listes valeurs'!$T$2:$W$3450,4,FALSE)","v":{"$error":"#N/A"}},{"$f":"VLOOKUP('compilation données pour export'!$R45,'listes valeurs'!$T$2:$W$3450,3,FALSE)","v":{"$error":"#N/A"}},"Nombre de territoires",{"$f":"IF(ISBLANK('2-OISEAUX'!$C$23),\"\",'2-OISEAUX'!$C$23)","v":""},"in",{"$f":"'Synthese Annuelle Monitoring'!$Q$24","v":0}]
[{"$f":"'0-INFOS GENERALES A REMPLIR'!$B$4","v":2021},{"$f":"'0-INFOS GENERALES A REMPLIR'!$B$6","v":0},{"$f":"IF(ISBLANK('0-INFOS GENERALES A REMPLIR'!$E$13),\"\",'0-INFOS GENERALES A REMPLIR'!$E$13)","v":""},{"$f":"IF(ISBLANK('0-INFOS GENERALES A REMPLIR'!$A$13),\"\",'0-INFOS GENERALES A REMPLIR'!$A$13)","v":""},{"$f":"IF(ISBLANK('0-INFOS GENERALES A REMPLIR'!$D$13),\"\",'0-INFOS GENERALES A REMPLIR'!$D$13)","v":""},{"$f":"IFERROR(INDEX('listes valeurs'!F$2:F$552,MATCH(1,('listes valeurs'!B$2:B$552=B46)*('listes valeurs'!E$2:E$552=D46),0)),\"\")","v":""},null,null,null,null,null,{"$f":"IF(ISBLANK('2-OISEAUX'!$F$9),\"\",'2-OISEAUX'!$F$9)","v":""},{"$f":"IF(ISBLANK('2-OISEAUX'!$F$10),\"\",'2-OISEAUX'!$F$10)","v":""},{"$f":"IF(ISBLANK('2-OISEAUX'!$G$10),\"\",'2-OISEAUX'!$G$10)","v":""},{"$f":"IF(ISBLANK('2-OISEAUX'!$F$13),\"\",'2-OISEAUX'!$F$13)","v":""},{"$f":"IF(ISBLANK('2-OISEAUX'!$F$8),\"\",'2-OISEAUX'!$F$8)","v":""},{"$f":"VLOOKUP('compilation données pour export'!$R46,'listes valeurs'!$T$2:$W$3450,2,FALSE)","v":{"$error":"#N/A"}},{"$f":"IF(ISBLANK('2-OISEAUX'!$A$23),\"\",'2-OISEAUX'!$A$23)","v":""},{"$f":"VLOOKUP('compilation données pour export'!$R46,'listes valeurs'!$T$2:$W$3450,4,FALSE)","v":{"$error":"#N/A"}},{"$f":"VLOOKUP('compilation données pour export'!$R46,'listes valeurs'!$T$2:$W$3450,3,FALSE)","v":{"$error":"#N/A"}},"Nombre de territoires",{"$f":"IF(ISBLANK('2-OISEAUX'!$F$23),\"\",'2-OISEAUX'!$F$23)","v":""},"in",{"$f":"'Synthese Annuelle Monitoring'!$Q$24","v":0}]
[{"$f":"'0-INFOS GENERALES A REMPLIR'!$B$4","v":2021},{"$f":"'0-INFOS GENERALES A REMPLIR'!$B$6","v":0},{"$f":"IF(ISBLANK('0-INFOS GENERALES A REMPLIR'!$E$14),\"\",'0-INFOS GENERALES A REMPLIR'!$E$14)","v":""},{"$f":"IF(ISBLANK('0-INFOS GENERALES A REMPLIR'!$A$14),\"\",'0-INFOS GENERALES A REMPLIR'!$A$14)","v":""},{"$f":"IF(ISBLANK('0-INFOS GENERALES A REMPLIR'!$D$14),\"\",'0-INFOS GENERALES A REMPLIR'!$D$14)","v":""},{"$f":"IFERROR(INDEX('listes valeurs'!F$2:F$552,MATCH(1,('listes valeurs'!B$2:B$552=B47)*('listes valeurs'!E$2:E$552=D47),0)),\"\")","v":""},null,null,null,null,null,{"$f":"IF(ISBLANK('2-OISEAUX'!$I$9),\"\",'2-OISEAUX'!$I$9)","v":""},{"$f":"IF(ISBLANK('2-OISEAUX'!$I$10),\"\",'2-OISEAUX'!$I$10)","v":""},{"$f":"IF(ISBLANK('2-OISEAUX'!$J$10),\"\",'2-OISEAUX'!$J$10)","v":""},{"$f":"IF(ISBLANK('2-OISEAUX'!$I$13),\"\",'2-OISEAUX'!$I$13)","v":""},{"$f":"IF(ISBLANK('2-OISEAUX'!$I$8),\"\",'2-OISEAUX'!$I$8)","v":""},{"$f":"VLOOKUP('compilation données pour export'!$R47,'listes valeurs'!$T$2:$W$3450,2,FALSE)","v":{"$error":"#N/A"}},{"$f":"IF(ISBLANK('2-OISEAUX'!$A$23),\"\",'2-OISEAUX'!$A$23)","v":""},{"$f":"VLOOKUP('compilation données pour export'!$R47,'listes valeurs'!$T$2:$W$3450,4,FALSE)","v":{"$error":"#N/A"}},{"$f":"VLOOKUP('compilation données pour export'!$R47,'listes valeurs'!$T$2:$W$3450,3,FALSE)","v":{"$error":"#N/A"}},"Nombre de territoires",{"$f":"IF(ISBLANK('2-OISEAUX'!$I$23),\"\",'2-OISEAUX'!$I$23)","v":""},"in",{"$f":"'Synthese Annuelle Monitoring'!$Q$24","v":0}]
[{"$f":"'0-INFOS GENERALES A REMPLIR'!$B$4","v":2021},{"$f":"'0-INFOS GENERALES A REMPLIR'!$B$6","v":0},{"$f":"IF(ISBLANK('0-INFOS GENERALES A REMPLIR'!$E$15),\"\",'0-INFOS GENERALES A REMPLIR'!$E$15)","v":""},{"$f":"IF(ISBLANK('0-INFOS GENERALES A REMPLIR'!$A$15),\"\",'0-INFOS GENERALES A REMPLIR'!$A$15)","v":""},{"$f":"IF(ISBLANK('0-INFOS GENERALES A REMPLIR'!$D$15),\"\",'0-INFOS GENERALES A REMPLIR'!$D$15)","v":""},{"$f":"IFERROR(INDEX('listes valeurs'!F$2:F$552,MATCH(1,('listes valeurs'!B$2:B$552=B48)*('listes valeurs'!E$2:E$552=D48),0)),\"\")","v":""},null,null,null,null,null,{"$f":"IF(ISBLANK('2-OISEAUX'!$L$9),\"\",'2-OISEAUX'!$L$9)","v":""},{"$f":"IF(ISBLANK('2-OISEAUX'!$L$10),\"\",'2-OISEAUX'!$L$10)","v":""},{"$f":"IF(ISBLANK('2-OISEAUX'!$M$10),\"\",'2-OISEAUX'!$M$10)","v":""},{"$f":"IF(ISBLANK('2-OISEAUX'!$L$13),\"\",'2-OISEAUX'!$L$13)","v":""},{"$f":"IF(ISBLANK('2-OISEAUX'!$L$8),\"\",'2-OISEAUX'!$L$8)","v":""},{"$f":"VLOOKUP('compilation données pour export'!$R48,'listes valeurs'!$T$2:$W$3450,2,FALSE)","v":{"$error":"#N/A"}},{"$f":"IF(ISBLANK('2-OISEAUX'!$A$23),\"\",'2-OISEAUX'!$A$23)","v":""},{"$f":"VLOOKUP('compilation données pour export'!$R48,'listes valeurs'!$T$2:$W$3450,4,FALSE)","v":{"$error":"#N/A"}},{"$f":"VLOOKUP('compilation données pour export'!$R48,'listes valeurs'!$T$2:$W$3450,3,FALSE)","v":{"$error":"#N/A"}},"Nombre de territoires",{"$f":"IF(ISBLANK('2-OISEAUX'!$L$23),\"\",'2-OISEAUX'!$L$23)","v":""},"in",{"$f":"'Synthese Annuelle Monitoring'!$Q$24","v":0}]
[{"$f":"'0-INFOS GENERALES A REMPLIR'!$B$4","v":2021},{"$f":"'0-INFOS GENERALES A REMPLIR'!$B$6","v":0},{"$f":"IF(ISBLANK('0-INFOS GENERALES A REMPLIR'!$E$16),\"\",'0-INFOS GENERALES A REMPLIR'!$E$16)","v":""},{"$f":"IF(ISBLANK('0-INFOS GENERALES A REMPLIR'!$A$16),\"\",'0-INFOS GENERALES A REMPLIR'!$A$16)","v":""},{"$f":"IF(ISBLANK('0-INFOS GENERALES A REMPLIR'!$D$16),\"\",'0-INFOS GENERALES A REMPLIR'!$D$16)","v":""},{"$f":"IFERROR(INDEX('listes valeurs'!F$2:F$552,MATCH(1,('listes valeurs'!B$2:B$552=B49)*('listes valeurs'!E$2:E$552=D49),0)),\"\")","v":""},null,null,null,null,null,{"$f":"IF(ISBLANK('2-OISEAUX'!$O$9),\"\",'2-OISEAUX'!$O$9)","v":""},{"$f":"IF(ISBLANK('2-OISEAUX'!$O$10),\"\",'2-OISEAUX'!$O$10)","v":""},{"$f":"IF(ISBLANK('2-OISEAUX'!$P$10),\"\",'2-OISEAUX'!$P$10)","v":""},{"$f":"IF(ISBLANK('2-OISEAUX'!$O$13),\"\",'2-OISEAUX'!$O$13)","v":""},{"$f":"IF(ISBLANK('2-OISEAUX'!$O$8),\"\",'2-OISEAUX'!$O$8)","v":""},{"$f":"VLOOKUP('compilation données pour export'!$R49,'listes valeurs'!$T$2:$W$3450,2,FALSE)","v":{"$error":"#N/A"}},{"$f":"IF(ISBLANK('2-OISEAUX'!$A$23),\"\",'2-OISEAUX'!$A$23)","v":""},{"$f":"VLOOKUP('compilation données pour export'!$R49,'listes valeurs'!$T$2:$W$3450,4,FALSE)","v":{"$error":"#N/A"}},{"$f":"VLOOKUP('compilation données pour export'!$R49,'listes valeurs'!$T$2:$W$3450,3,FALSE)","v":{"$error":"#N/A"}},"Nombre de territoires",{"$f":"IF(ISBLANK('2-OISEAUX'!$O$23),\"\",'2-OISEAUX'!$O$23)","v":""},"in",{"$f":"'Synthese Annuelle Monitoring'!$Q$24","v":0}]
[{"$f":"'0-INFOS GENERALES A REMPLIR'!$B$4","v":2021},{"$f":"'0-INFOS GENERALES A REMPLIR'!$B$6","v":0},{"$f":"IF(ISBLANK('0-INFOS GENERALES A REMPLIR'!$E$12),\"\",'0-INFOS GENERALES A REMPLIR'!$E$12)","v":""},{"$f":"IF(ISBLANK('0-INFOS GENERALES A REMPLIR'!$A$12),\"\",'0-INFOS GENERALES A REMPLIR'!$A$12)","v":""},{"$f":"IF(ISBLANK('0-INFOS GENERALES A REMPLIR'!$D$12),\"\",'0-INFOS GENERALES A REMPLIR'!$D$12)","v":""},{"$f":"IFERROR(INDEX('listes valeurs'!F$2:F$552,MATCH(1,('listes valeurs'!B$2:B$552=B50)*('listes valeurs'!E$2:E$552=D50),0)),\"\")","v":""},null,null,null,null,null,{"$f":"IF(ISBLANK('2-OISEAUX'!$C$9),\"\",'2-OISEAUX'!$C$9)","v":""},{"$f":"IF(ISBLANK('2-OISEAUX'!$C$10),\"\",'2-OISEAUX'!$C$10)","v":""},{"$f":"IF(ISBLANK('2-OISEAUX'!$D$10),\"\",'2-OISEAUX'!$D$10)","v":""},{"$f":"IF(ISBLANK('2-OISEAUX'!$C$13),\"\",'2-OISEAUX'!$C$13)","v":""},{"$f":"IF(ISBLANK('2-OISEAUX'!$C$8),\"\",'2-OISEAUX'!$C$8)","v":""},{"$f":"VLOOKUP('compilation données pour export'!$R50,'listes valeurs'!$T$2:$W$3450,2,FALSE)","v":{"$error":"#N/A"}},{"$f":"IF(ISBLANK('2-OISEAUX'!$A$24),\"\",'2-OISEAUX'!$A$24)","v":""},{"$f":"VLOOKUP('compilation données pour export'!$R50,'listes valeurs'!$T$2:$W$3450,4,FALSE)","v":{"$error":"#N/A"}},{"$f":"VLOOKUP('compilation données pour export'!$R50,'listes valeurs'!$T$2:$W$3450,3,FALSE)","v":{"$error":"#N/A"}},"Nombre de territoires",{"$f":"IF(ISBLANK('2-OISEAUX'!$C$24),\"\",'2-OISEAUX'!$C$24)","v":""},"in",{"$f":"'Synthese Annuelle Monitoring'!$Q$25","v":0}]
[{"$f":"'0-INFOS GENERALES A REMPLIR'!$B$4","v":2021},{"$f":"'0-INFOS GENERALES A REMPLIR'!$B$6","v":0},{"$f":"IF(ISBLANK('0-INFOS GENERALES A REMPLIR'!$E$13),\"\",'0-INFOS GENERALES A REMPLIR'!$E$13)","v":""},{"$f":"IF(ISBLANK('0-INFOS GENERALES A REMPLIR'!$A$13),\"\",'0-INFOS GENERALES A REMPLIR'!$A$13)","v":""},{"$f":"IF(ISBLANK('0-INFOS GENERALES A REMPLIR'!$D$13),\"\",'0-INFOS GENERALES A REMPLIR'!$D$13)","v":""},{"$f":"IFERROR(INDEX('listes valeurs'!F$2:F$552,MATCH(1,('listes valeurs'!B$2:B$552=B51)*('listes valeurs'!E$2:E$552=D51),0)),\"\")","v":""},null,null,null,null,null,{"$f":"IF(ISBLANK('2-OISEAUX'!$F$9),\"\",'2-OISEAUX'!$F$9)","v":""},{"$f":"IF(ISBLANK('2-OISEAUX'!$F$10),\"\",'2-OISEAUX'!$F$10)","v":""},{"$f":"IF(ISBLANK('2-OISEAUX'!$G$10),\"\",'2-OISEAUX'!$G$10)","v":""},{"$f":"IF(ISBLANK('2-OISEAUX'!$F$13),\"\",'2-OISEAUX'!$F$13)","v":""},{"$f":"IF(ISBLANK('2-OISEAUX'!$F$8),\"\",'2-OISEAUX'!$F$8)","v":""},{"$f":"VLOOKUP('compilation données pour export'!$R51,'listes valeurs'!$T$2:$W$3450,2,FALSE)","v":{"$error":"#N/A"}},{"$f":"IF(ISBLANK('2-OISEAUX'!$A$24),\"\",'2-OISEAUX'!$A$24)","v":""},{"$f":"VLOOKUP('compilation données pour export'!$R51,'listes valeurs'!$T$2:$W$3450,4,FALSE)","v":{"$error":"#N/A"}},{"$f":"VLOOKUP('compilation données pour export'!$R51,'listes valeurs'!$T$2:$W$3450,3,FALSE)","v":{"$error":"#N/A"}},"Nombre de territoires",{"$f":"IF(ISBLANK('2-OISEAUX'!$F$24),\"\",'2-OISEAUX'!$F$24)","v":""},"in",{"$f":"'Synthese Annuelle Monitoring'!$Q$25","v":0}]
[{"$f":"'0-INFOS GENERALES A REMPLIR'!$B$4","v":2021},{"$f":"'0-INFOS GENERALES A REMPLIR'!$B$6","v":0},{"$f":"IF(ISBLANK('0-INFOS GENERALES A REMPLIR'!$E$14),\"\",'0-INFOS GENERALES A REMPLIR'!$E$14)","v":""},{"$f":"IF(ISBLANK('0-INFOS GENERALES A REMPLIR'!$A$14),\"\",'0-INFOS GENERALES A REMPLIR'!$A$14)","v":""},{"$f":"IF(ISBLANK('0-INFOS GENERALES A REMPLIR'!$D$14),\"\",'0-INFOS GENERALES A REMPLIR'!$D$14)","v":""},{"$f":"IFERROR(INDEX('listes valeurs'!F$2:F$552,MATCH(1,('listes valeurs'!B$2:B$552=B52)*('listes valeurs'!E$2:E$552=D52),0)),\"\")","v":""},null,null,null,null,null,{"$f":"IF(ISBLANK('2-OISEAUX'!$I$9),\"\",'2-OISEAUX'!$I$9)","v":""},{"$f":"IF(ISBLANK('2-OISEAUX'!$I$10),\"\",'2-OISEAUX'!$I$10)","v":""},{"$f":"IF(ISBLANK('2-OISEAUX'!$J$10),\"\",'2-OISEAUX'!$J$10)","v":""},{"$f":"IF(ISBLANK('2-OISEAUX'!$I$13),\"\",'2-OISEAUX'!$I$13)","v":""},{"$f":"IF(ISBLANK('2-OISEAUX'!$I$8),\"\",'2-OISEAUX'!$I$8)","v":""},{"$f":"VLOOKUP('compilation données pour export'!$R52,'listes valeurs'!$T$2:$W$3450,2,FALSE)","v":{"$error":"#N/A"}},{"$f":"IF(ISBLANK('2-OISEAUX'!$A$24),\"\",'2-OISEAUX'!$A$24)","v":""},{"$f":"VLOOKUP('compilation données pour export'!$R52,'listes valeurs'!$T$2:$W$3450,4,FALSE)","v":{"$error":"#N/A"}},{"$f":"VLOOKUP('compilation données pour export'!$R52,'listes valeurs'!$T$2:$W$3450,3,FALSE)","v":{"$error":"#N/A"}},"Nombre de territoires",{"$f":"IF(ISBLANK('2-OISEAUX'!$I$24),\"\",'2-OISEAUX'!$I$24)","v":""},"in",{"$f":"'Synthese Annuelle Monitoring'!$Q$25","v":0}]
[{"$f":"'0-INFOS GENERALES A REMPLIR'!$B$4","v":2021},{"$f":"'0-INFOS GENERALES A REMPLIR'!$B$6","v":0},{"$f":"IF(ISBLANK('0-INFOS GENERALES A REMPLIR'!$E$15),\"\",'0-INFOS GENERALES A REMPLIR'!$E$15)","v":""},{"$f":"IF(ISBLANK('0-INFOS GENERALES A REMPLIR'!$A$15),\"\",'0-INFOS GENERALES A REMPLIR'!$A$15)","v":""},{"$f":"IF(ISBLANK('0-INFOS GENERALES A REMPLIR'!$D$15),\"\",'0-INFOS GENERALES A REMPLIR'!$D$15)","v":""},{"$f":"IFERROR(INDEX('listes valeurs'!F$2:F$552,MATCH(1,('listes valeurs'!B$2:B$552=B53)*('listes valeurs'!E$2:E$552=D53),0)),\"\")","v":""},null,null,null,null,null,{"$f":"IF(ISBLANK('2-OISEAUX'!$L$9),\"\",'2-OISEAUX'!$L$9)","v":""},{"$f":"IF(ISBLANK('2-OISEAUX'!$L$10),\"\",'2-OISEAUX'!$L$10)","v":""},{"$f":"IF(ISBLANK('2-OISEAUX'!$M$10),\"\",'2-OISEAUX'!$M$10)","v":""},{"$f":"IF(ISBLANK('2-OISEAUX'!$L$13),\"\",'2-OISEAUX'!$L$13)","v":""},{"$f":"IF(ISBLANK('2-OISEAUX'!$L$8),\"\",'2-OISEAUX'!$L$8)","v":""},{"$f":"VLOOKUP('compilation données pour export'!$R53,'listes valeurs'!$T$2:$W$3450,2,FALSE)","v":{"$error":"#N/A"}},{"$f":"IF(ISBLANK('2-OISEAUX'!$A$24),\"\",'2-OISEAUX'!$A$24)","v":""},{"$f":"VLOOKUP('compilation données pour export'!$R53,'listes valeurs'!$T$2:$W$3450,4,FALSE)","v":{"$error":"#N/A"}},{"$f":"VLOOKUP('compilation données pour export'!$R53,'listes valeurs'!$T$2:$W$3450,3,FALSE)","v":{"$error":"#N/A"}},"Nombre de territoires",{"$f":"IF(ISBLANK('2-OISEAUX'!$L$24),\"\",'2-OISEAUX'!$L$24)","v":""},"in",{"$f":"'Synthese Annuelle Monitoring'!$Q$25","v":0}]
[{"$f":"'0-INFOS GENERALES A REMPLIR'!$B$4","v":2021},{"$f":"'0-INFOS GENERALES A REMPLIR'!$B$6","v":0},{"$f":"IF(ISBLANK('0-INFOS GENERALES A REMPLIR'!$E$16),\"\",'0-INFOS GENERALES A REMPLIR'!$E$16)","v":""},{"$f":"IF(ISBLANK('0-INFOS GENERALES A REMPLIR'!$A$16),\"\",'0-INFOS GENERALES A REMPLIR'!$A$16)","v":""},{"$f":"IF(ISBLANK('0-INFOS GENERALES A REMPLIR'!$D$16),\"\",'0-INFOS GENERALES A REMPLIR'!$D$16)","v":""},{"$f":"IFERROR(INDEX('listes valeurs'!F$2:F$552,MATCH(1,('listes valeurs'!B$2:B$552=B54)*('listes valeurs'!E$2:E$552=D54),0)),\"\")","v":""},null,null,null,null,null,{"$f":"IF(ISBLANK('2-OISEAUX'!$O$9),\"\",'2-OISEAUX'!$O$9)","v":""},{"$f":"IF(ISBLANK('2-OISEAUX'!$O$10),\"\",'2-OISEAUX'!$O$10)","v":""},{"$f":"IF(ISBLANK('2-OISEAUX'!$P$10),\"\",'2-OISEAUX'!$P$10)","v":""},{"$f":"IF(ISBLANK('2-OISEAUX'!$O$13),\"\",'2-OISEAUX'!$O$13)","v":""},{"$f":"IF(ISBLANK('2-OISEAUX'!$O$8),\"\",'2-OISEAUX'!$O$8)","v":""},{"$f":"VLOOKUP('compilation données pour export'!$R54,'listes valeurs'!$T$2:$W$3450,2,FALSE)","v":{"$error":"#N/A"}},{"$f":"IF(ISBLANK('2-OISEAUX'!$A$24),\"\",'2-OISEAUX'!$A$24)","v":""},{"$f":"VLOOKUP('compilation données pour export'!$R54,'listes valeurs'!$T$2:$W$3450,4,FALSE)","v":{"$error":"#N/A"}},{"$f":"VLOOKUP('compilation données pour export'!$R54,'listes valeurs'!$T$2:$W$3450,3,FALSE)","v":{"$error":"#N/A"}},"Nombre de territoires",{"$f":"IF(ISBLANK('2-OISEAUX'!$O$24),\"\",'2-OISEAUX'!$O$24)","v":""},"in",{"$f":"'Synthese Annuelle Monitoring'!$Q$25","v":0}]
[{"$f":"'0-INFOS GENERALES A REMPLIR'!$B$4","v":2021},{"$f":"'0-INFOS GENERALES A REMPLIR'!$B$6","v":0},{"$f":"IF(ISBLANK('0-INFOS GENERALES A REMPLIR'!$E$12),\"\",'0-INFOS GENERALES A REMPLIR'!$E$12)","v":""},{"$f":"IF(ISBLANK('0-INFOS GENERALES A REMPLIR'!$A$12),\"\",'0-INFOS GENERALES A REMPLIR'!$A$12)","v":""},{"$f":"IF(ISBLANK('0-INFOS GENERALES A REMPLIR'!$D$12),\"\",'0-INFOS GENERALES A REMPLIR'!$D$12)","v":""},{"$f":"IFERROR(INDEX('listes valeurs'!F$2:F$552,MATCH(1,('listes valeurs'!B$2:B$552=B55)*('listes valeurs'!E$2:E$552=D55),0)),\"\")","v":""},null,null,null,null,null,{"$f":"IF(ISBLANK('2-OISEAUX'!$C$9),\"\",'2-OISEAUX'!$C$9)","v":""},{"$f":"IF(ISBLANK('2-OISEAUX'!$C$10),\"\",'2-OISEAUX'!$C$10)","v":""},{"$f":"IF(ISBLANK('2-OISEAUX'!$D$10),\"\",'2-OISEAUX'!$D$10)","v":""},{"$f":"IF(ISBLANK('2-OISEAUX'!$C$13),\"\",'2-OISEAUX'!$C$13)","v":""},{"$f":"IF(ISBLANK('2-OISEAUX'!$C$8),\"\",'2-OISEAUX'!$C$8)","v":""},{"$f":"VLOOKUP('compilation données pour export'!$R55,'listes valeurs'!$T$2:$W$3450,2,FALSE)","v":{"$error":"#N/A"}},{"$f":"IF(ISBLANK('2-OISEAUX'!$A$25),\"\",'2-OISEAUX'!$A$25)","v":""},{"$f":"VLOOKUP('compilation données pour export'!$R55,'listes valeurs'!$T$2:$W$3450,4,FALSE)","v":{"$error":"#N/A"}},{"$f":"VLOOKUP('compilation données pour export'!$R55,'listes valeurs'!$T$2:$W$3450,3,FALSE)","v":{"$error":"#N/A"}},"Nombre de territoires",{"$f":"IF(ISBLANK('2-OISEAUX'!$C$25),\"\",'2-OISEAUX'!$C$25)","v":""},"in",{"$f":"'Synthese Annuelle Monitoring'!$Q$26","v":0}]
[{"$f":"'0-INFOS GENERALES A REMPLIR'!$B$4","v":2021},{"$f":"'0-INFOS GENERALES A REMPLIR'!$B$6","v":0},{"$f":"IF(ISBLANK('0-INFOS GENERALES A REMPLIR'!$E$13),\"\",'0-INFOS GENERALES A REMPLIR'!$E$13)","v":""},{"$f":"IF(ISBLANK('0-INFOS GENERALES A REMPLIR'!$A$13),\"\",'0-INFOS GENERALES A REMPLIR'!$A$13)","v":""},{"$f":"IF(ISBLANK('0-INFOS GENERALES A REMPLIR'!$D$13),\"\",'0-INFOS GENERALES A REMPLIR'!$D$13)","v":""},{"$f":"IFERROR(INDEX('listes valeurs'!F$2:F$552,MATCH(1,('listes valeurs'!B$2:B$552=B56)*('listes valeurs'!E$2:E$552=D56),0)),\"\")","v":""},null,null,null,null,null,{"$f":"IF(ISBLANK('2-OISEAUX'!$F$9),\"\",'2-OISEAUX'!$F$9)","v":""},{"$f":"IF(ISBLANK('2-OISEAUX'!$F$10),\"\",'2-OISEAUX'!$F$10)","v":""},{"$f":"IF(ISBLANK('2-OISEAUX'!$G$10),\"\",'2-OISEAUX'!$G$10)","v":""},{"$f":"IF(ISBLANK('2-OISEAUX'!$F$13),\"\",'2-OISEAUX'!$F$13)","v":""},{"$f":"IF(ISBLANK('2-OISEAUX'!$F$8),\"\",'2-OISEAUX'!$F$8)","v":""},{"$f":"VLOOKUP('compilation données pour export'!$R56,'listes valeurs'!$T$2:$W$3450,2,FALSE)","v":{"$error":"#N/A"}},{"$f":"IF(ISBLANK('2-OISEAUX'!$A$25),\"\",'2-OISEAUX'!$A$25)","v":""},{"$f":"VLOOKUP('compilation données pour export'!$R56,'listes valeurs'!$T$2:$W$3450,4,FALSE)","v":{"$error":"#N/A"}},{"$f":"VLOOKUP('compilation données pour export'!$R56,'listes valeurs'!$T$2:$W$3450,3,FALSE)","v":{"$error":"#N/A"}},"Nombre de territoires",{"$f":"IF(ISBLANK('2-OISEAUX'!$F$25),\"\",'2-OISEAUX'!$F$25)","v":""},"in",{"$f":"'Synthese Annuelle Monitoring'!$Q$26","v":0}]
[{"$f":"'0-INFOS GENERALES A REMPLIR'!$B$4","v":2021},{"$f":"'0-INFOS GENERALES A REMPLIR'!$B$6","v":0},{"$f":"IF(ISBLANK('0-INFOS GENERALES A REMPLIR'!$E$14),\"\",'0-INFOS GENERALES A REMPLIR'!$E$14)","v":""},{"$f":"IF(ISBLANK('0-INFOS GENERALES A REMPLIR'!$A$14),\"\",'0-INFOS GENERALES A REMPLIR'!$A$14)","v":""},{"$f":"IF(ISBLANK('0-INFOS GENERALES A REMPLIR'!$D$14),\"\",'0-INFOS GENERALES A REMPLIR'!$D$14)","v":""},{"$f":"IFERROR(INDEX('listes valeurs'!F$2:F$552,MATCH(1,('listes valeurs'!B$2:B$552=B57)*('listes valeurs'!E$2:E$552=D57),0)),\"\")","v":""},null,null,null,null,null,{"$f":"IF(ISBLANK('2-OISEAUX'!$I$9),\"\",'2-OISEAUX'!$I$9)","v":""},{"$f":"IF(ISBLANK('2-OISEAUX'!$I$10),\"\",'2-OISEAUX'!$I$10)","v":""},{"$f":"IF(ISBLANK('2-OISEAUX'!$J$10),\"\",'2-OISEAUX'!$J$10)","v":""},{"$f":"IF(ISBLANK('2-OISEAUX'!$I$13),\"\",'2-OISEAUX'!$I$13)","v":""},{"$f":"IF(ISBLANK('2-OISEAUX'!$I$8),\"\",'2-OISEAUX'!$I$8)","v":""},{"$f":"VLOOKUP('compilation données pour export'!$R57,'listes valeurs'!$T$2:$W$3450,2,FALSE)","v":{"$error":"#N/A"}},{"$f":"IF(ISBLANK('2-OISEAUX'!$A$25),\"\",'2-OISEAUX'!$A$25)","v":""},{"$f":"VLOOKUP('compilation données pour export'!$R57,'listes valeurs'!$T$2:$W$3450,4,FALSE)","v":{"$error":"#N/A"}},{"$f":"VLOOKUP('compilation données pour export'!$R57,'listes valeurs'!$T$2:$W$3450,3,FALSE)","v":{"$error":"#N/A"}},"Nombre de territoires",{"$f":"IF(ISBLANK('2-OISEAUX'!$I$25),\"\",'2-OISEAUX'!$I$25)","v":""},"in",{"$f":"'Synthese Annuelle Monitoring'!$Q$26","v":0}]
[{"$f":"'0-INFOS GENERALES A REMPLIR'!$B$4","v":2021},{"$f":"'0-INFOS GENERALES A REMPLIR'!$B$6","v":0},{"$f":"IF(ISBLANK('0-INFOS GENERALES A REMPLIR'!$E$15),\"\",'0-INFOS GENERALES A REMPLIR'!$E$15)","v":""},{"$f":"IF(ISBLANK('0-INFOS GENERALES A REMPLIR'!$A$15),\"\",'0-INFOS GENERALES A REMPLIR'!$A$15)","v":""},{"$f":"IF(ISBLANK('0-INFOS GENERALES A REMPLIR'!$D$15),\"\",'0-INFOS GENERALES A REMPLIR'!$D$15)","v":""},{"$f":"IFERROR(INDEX('listes valeurs'!F$2:F$552,MATCH(1,('listes valeurs'!B$2:B$552=B58)*('listes valeurs'!E$2:E$552=D58),0)),\"\")","v":""},null,null,null,null,null,{"$f":"IF(ISBLANK('2-OISEAUX'!$L$9),\"\",'2-OISEAUX'!$L$9)","v":""},{"$f":"IF(ISBLANK('2-OISEAUX'!$L$10),\"\",'2-OISEAUX'!$L$10)","v":""},{"$f":"IF(ISBLANK('2-OISEAUX'!$M$10),\"\",'2-OISEAUX'!$M$10)","v":""},{"$f":"IF(ISBLANK('2-OISEAUX'!$L$13),\"\",'2-OISEAUX'!$L$13)","v":""},{"$f":"IF(ISBLANK('2-OISEAUX'!$L$8),\"\",'2-OISEAUX'!$L$8)","v":""},{"$f":"VLOOKUP('compilation données pour export'!$R58,'listes valeurs'!$T$2:$W$3450,2,FALSE)","v":{"$error":"#N/A"}},{"$f":"IF(ISBLANK('2-OISEAUX'!$A$25),\"\",'2-OISEAUX'!$A$25)","v":""},{"$f":"VLOOKUP('compilation données pour export'!$R58,'listes valeurs'!$T$2:$W$3450,4,FALSE)","v":{"$error":"#N/A"}},{"$f":"VLOOKUP('compilation données pour export'!$R58,'listes valeurs'!$T$2:$W$3450,3,FALSE)","v":{"$error":"#N/A"}},"Nombre de territoires",{"$f":"IF(ISBLANK('2-OISEAUX'!$L$25),\"\",'2-OISEAUX'!$L$25)","v":""},"in",{"$f":"'Synthese Annuelle Monitoring'!$Q$26","v":0}]
[{"$f":"'0-INFOS GENERALES A REMPLIR'!$B$4","v":2021},{"$f":"'0-INFOS GENERALES A REMPLIR'!$B$6","v":0},{"$f":"IF(ISBLANK('0-INFOS GENERALES A REMPLIR'!$E$16),\"\",'0-INFOS GENERALES A REMPLIR'!$E$16)","v":""},{"$f":"IF(ISBLANK('0-INFOS GENERALES A REMPLIR'!$A$16),\"\",'0-INFOS GENERALES A REMPLIR'!$A$16)","v":""},{"$f":"IF(ISBLANK('0-INFOS GENERALES A REMPLIR'!$D$16),\"\",'0-INFOS GENERALES A REMPLIR'!$D$16)","v":""},{"$f":"IFERROR(INDEX('listes valeurs'!F$2:F$552,MATCH(1,('listes valeurs'!B$2:B$552=B59)*('listes valeurs'!E$2:E$552=D59),0)),\"\")","v":""},null,null,null,null,null,{"$f":"IF(ISBLANK('2-OISEAUX'!$O$9),\"\",'2-OISEAUX'!$O$9)","v":""},{"$f":"IF(ISBLANK('2-OISEAUX'!$O$10),\"\",'2-OISEAUX'!$O$10)","v":""},{"$f":"IF(ISBLANK('2-OISEAUX'!$P$10),\"\",'2-OISEAUX'!$P$10)","v":""},{"$f":"IF(ISBLANK('2-OISEAUX'!$O$13),\"\",'2-OISEAUX'!$O$13)","v":""},{"$f":"IF(ISBLANK('2-OISEAUX'!$O$8),\"\",'2-OISEAUX'!$O$8)","v":""},{"$f":"VLOOKUP('compilation données pour export'!$R59,'listes valeurs'!$T$2:$W$3450,2,FALSE)","v":{"$error":"#N/A"}},{"$f":"IF(ISBLANK('2-OISEAUX'!$A$25),\"\",'2-OISEAUX'!$A$25)","v":""},{"$f":"VLOOKUP('compilation données pour export'!$R59,'listes valeurs'!$T$2:$W$3450,4,FALSE)","v":{"$error":"#N/A"}},{"$f":"VLOOKUP('compilation données pour export'!$R59,'listes valeurs'!$T$2:$W$3450,3,FALSE)","v":{"$error":"#N/A"}},"Nombre de territoires",{"$f":"IF(ISBLANK('2-OISEAUX'!$O$25),\"\",'2-OISEAUX'!$O$25)","v":""},"in",{"$f":"'Synthese Annuelle Monitoring'!$Q$26","v":0}]
[{"$f":"'0-INFOS GENERALES A REMPLIR'!$B$4","v":2021},{"$f":"'0-INFOS GENERALES A REMPLIR'!$B$6","v":0},{"$f":"IF(ISBLANK('0-INFOS GENERALES A REMPLIR'!$E$12),\"\",'0-INFOS GENERALES A REMPLIR'!$E$12)","v":""},{"$f":"IF(ISBLANK('0-INFOS GENERALES A REMPLIR'!$A$12),\"\",'0-INFOS GENERALES A REMPLIR'!$A$12)","v":""},{"$f":"IF(ISBLANK('0-INFOS GENERALES A REMPLIR'!$D$12),\"\",'0-INFOS GENERALES A REMPLIR'!$D$12)","v":""},{"$f":"IFERROR(INDEX('listes valeurs'!F$2:F$552,MATCH(1,('listes valeurs'!B$2:B$552=B60)*('listes valeurs'!E$2:E$552=D60),0)),\"\")","v":""},null,null,null,null,{"$f":"'3-PAPILLONS'!$C$10","v":"Passage 1"},{"$f":"IF(ISBLANK('3-PAPILLONS'!$C$12),\"\",'3-PAPILLONS'!$C$12)","v":""},{"$f":"IF(ISBLANK('3-PAPILLONS'!$C$14),\"\",'3-PAPILLONS'!$C$14)","v":""},{"$f":"IF(ISBLANK('3-PAPILLONS'!$D$14),\"\",'3-PAPILLONS'!$D$14)","v":""},{"$f":"IF(ISBLANK('3-PAPILLONS'!$C$8),\"\",'3-PAPILLONS'!$C$8)","v":""},{"$f":"IF(ISBLANK('3-PAPILLONS'!$C$11),\"\",'3-PAPILLONS'!$C$11)","v":""},{"$f":"VLOOKUP('compilation données pour export'!$R60,'listes valeurs'!$X$2:$AA$3450,2,FALSE)","v":"Demi-deuil"},{"$f":"'3-PAPILLONS'!$A$18","v":"DEM"},{"$f":"VLOOKUP('compilation données pour export'!$R60,'listes valeurs'!$X$2:$AA$3450,4,FALSE)","v":"Melanargia galathea"},{"$f":"VLOOKUP('compilation données pour export'!$R60,'listes valeurs'!$X$2:$AA$3450,3,FALSE)","v":"Papillons"},"Nombre individus",{"$f":"IF(ISBLANK('3-PAPILLONS'!C$18),\"\",'3-PAPILLONS'!C$18)","v":""},"in",{"$f":"'Synthese Annuelle Monitoring'!$Q$29","v":0}]
[{"$f":"'0-INFOS GENERALES A REMPLIR'!$B$4","v":2021},{"$f":"'0-INFOS GENERALES A REMPLIR'!$B$6","v":0},{"$f":"IF(ISBLANK('0-INFOS GENERALES A REMPLIR'!$E$12),\"\",'0-INFOS GENERALES A REMPLIR'!$E$12)","v":""},{"$f":"IF(ISBLANK('0-INFOS GENERALES A REMPLIR'!$A$12),\"\",'0-INFOS GENERALES A REMPLIR'!$A$12)","v":""},{"$f":"IF(ISBLANK('0-INFOS GENERALES A REMPLIR'!$D$12),\"\",'0-INFOS GENERALES A REMPLIR'!$D$12)","v":""},{"$f":"IFERROR(INDEX('listes valeurs'!F$2:F$552,MATCH(1,('listes valeurs'!B$2:B$552=B61)*('listes valeurs'!E$2:E$552=D61),0)),\"\")","v":""},null,null,null,null,{"$f":"'3-PAPILLONS'!$C$10","v":"Passage 1"},{"$f":"IF(ISBLANK('3-PAPILLONS'!$C$12),\"\",'3-PAPILLONS'!$C$12)","v":""},{"$f":"IF(ISBLANK('3-PAPILLONS'!$C$14),\"\",'3-PAPILLONS'!$C$14)","v":""},{"$f":"IF(ISBLANK('3-PAPILLONS'!$D$14),\"\",'3-PAPILLONS'!$D$14)","v":""},{"$f":"IF(ISBLANK('3-PAPILLONS'!$C$8),\"\",'3-PAPILLONS'!$C$8)","v":""},{"$f":"IF(ISBLANK('3-PAPILLONS'!$C$11),\"\",'3-PAPILLONS'!$C$11)","v":""},{"$f":"VLOOKUP('compilation données pour export'!$R61,'listes valeurs'!$X$2:$AA$3450,2,FALSE)","v":"Demi-deuil"},{"$f":"'3-PAPILLONS'!$A$18","v":"DEM"},{"$f":"VLOOKUP('compilation données pour export'!$R61,'listes valeurs'!$X$2:$AA$3450,4,FALSE)","v":"Melanargia galathea"},{"$f":"VLOOKUP('compilation données pour export'!$R61,'listes valeurs'!$X$2:$AA$3450,3,FALSE)","v":"Papillons"},"Nombre individus",{"$f":"IF(ISBLANK('3-PAPILLONS'!D$18),\"\",'3-PAPILLONS'!D$18)","v":""},"out",{"$f":"'Synthese Annuelle Monitoring'!$Q$29","v":0}]
[{"$f":"'0-INFOS GENERALES A REMPLIR'!$B$4","v":2021},{"$f":"'0-INFOS GENERALES A REMPLIR'!$B$6","v":0},{"$f":"IF(ISBLANK('0-INFOS GENERALES A REMPLIR'!$E$12),\"\",'0-INFOS GENERALES A REMPLIR'!$E$12)","v":""},{"$f":"IF(ISBLANK('0-INFOS GENERALES A REMPLIR'!$A$12),\"\",'0-INFOS GENERALES A REMPLIR'!$A$12)","v":""},{"$f":"IF(ISBLANK('0-INFOS GENERALES A REMPLIR'!$D$12),\"\",'0-INFOS GENERALES A REMPLIR'!$D$12)","v":""},{"$f":"IFERROR(INDEX('listes valeurs'!F$2:F$552,MATCH(1,('listes valeurs'!B$2:B$552=B62)*('listes valeurs'!E$2:E$552=D62),0)),\"\")","v":""},null,null,null,null,{"$f":"'3-PAPILLONS'!$F$10","v":"Passage 2"},{"$f":"IF(ISBLANK('3-PAPILLONS'!$F$12),\"\",'3-PAPILLONS'!$F$12)","v":""},{"$f":"IF(ISBLANK('3-PAPILLONS'!$F$14),\"\",'3-PAPILLONS'!$F$14)","v":""},{"$f":"IF(ISBLANK('3-PAPILLONS'!$G$14),\"\",'3-PAPILLONS'!$G$14)","v":""},{"$f":"IF(ISBLANK('3-PAPILLONS'!$C$8),\"\",'3-PAPILLONS'!$C$8)","v":""},{"$f":"IF(ISBLANK('3-PAPILLONS'!$F$11),\"\",'3-PAPILLONS'!$F$11)","v":""},{"$f":"VLOOKUP('compilation données pour export'!$R62,'listes valeurs'!$X$2:$AA$3450,2,FALSE)","v":"Demi-deuil"},{"$f":"'3-PAPILLONS'!$A$18","v":"DEM"},{"$f":"VLOOKUP('compilation données pour export'!$R62,'listes valeurs'!$X$2:$AA$3450,4,FALSE)","v":"Melanargia galathea"},{"$f":"VLOOKUP('compilation données pour export'!$R62,'listes valeurs'!$X$2:$AA$3450,3,FALSE)","v":"Papillons"},"Nombre individus",{"$f":"IF(ISBLANK('3-PAPILLONS'!F$18),\"\",'3-PAPILLONS'!F$18)","v":""},"in",{"$f":"'Synthese Annuelle Monitoring'!$Q$29","v":0}]
[{"$f":"'0-INFOS GENERALES A REMPLIR'!$B$4","v":2021},{"$f":"'0-INFOS GENERALES A REMPLIR'!$B$6","v":0},{"$f":"IF(ISBLANK('0-INFOS GENERALES A REMPLIR'!$E$12),\"\",'0-INFOS GENERALES A REMPLIR'!$E$12)","v":""},{"$f":"IF(ISBLANK('0-INFOS GENERALES A REMPLIR'!$A$12),\"\",'0-INFOS GENERALES A REMPLIR'!$A$12)","v":""},{"$f":"IF(ISBLANK('0-INFOS GENERALES A REMPLIR'!$D$12),\"\",'0-INFOS GENERALES A REMPLIR'!$D$12)","v":""},{"$f":"IFERROR(INDEX('listes valeurs'!F$2:F$552,MATCH(1,('listes valeurs'!B$2:B$552=B63)*('listes valeurs'!E$2:E$552=D63),0)),\"\")","v":""},null,null,null,null,{"$f":"'3-PAPILLONS'!$F$10","v":"Passage 2"},{"$f":"IF(ISBLANK('3-PAPILLONS'!$F$12),\"\",'3-PAPILLONS'!$F$12)","v":""},{"$f":"IF(ISBLANK('3-PAPILLONS'!$F$14),\"\",'3-PAPILLONS'!$F$14)","v":""},{"$f":"IF(ISBLANK('3-PAPILLONS'!$G$14),\"\",'3-PAPILLONS'!$G$14)","v":""},{"$f":"IF(ISBLANK('3-PAPILLONS'!$C$8),\"\",'3-PAPILLONS'!$C$8)","v":""},{"$f":"IF(ISBLANK('3-PAPILLONS'!$F$11),\"\",'3-PAPILLONS'!$F$11)","v":""},{"$f":"VLOOKUP('compilation données pour export'!$R63,'listes valeurs'!$X$2:$AA$3450,2,FALSE)","v":"Demi-deuil"},{"$f":"'3-PAPILLONS'!$A$18","v":"DEM"},{"$f":"VLOOKUP('compilation données pour export'!$R63,'listes valeurs'!$X$2:$AA$3450,4,FALSE)","v":"Melanargia galathea"},{"$f":"VLOOKUP('compilation données pour export'!$R63,'listes valeurs'!$X$2:$AA$3450,3,FALSE)","v":"Papillons"},"Nombre individus",{"$f":"IF(ISBLANK('3-PAPILLONS'!G$18),\"\",'3-PAPILLONS'!G$18)","v":""},"out",{"$f":"'Synthese Annuelle Monitoring'!$Q$29","v":0}]
[{"$f":"'0-INFOS GENERALES A REMPLIR'!$B$4","v":2021},{"$f":"'0-INFOS GENERALES A REMPLIR'!$B$6","v":0},{"$f":"IF(ISBLANK('0-INFOS GENERALES A REMPLIR'!$E$13),\"\",'0-INFOS GENERALES A REMPLIR'!$E$13)","v":""},{"$f":"IF(ISBLANK('0-INFOS GENERALES A REMPLIR'!$A$13),\"\",'0-INFOS GENERALES A REMPLIR'!$A$13)","v":""},{"$f":"IF(ISBLANK('0-INFOS GENERALES A REMPLIR'!$D$13),\"\",'0-INFOS GENERALES A REMPLIR'!$D$13)","v":""},{"$f":"IFERROR(INDEX('listes valeurs'!F$2:F$552,MATCH(1,('listes valeurs'!B$2:B$552=B64)*('listes valeurs'!E$2:E$552=D64),0)),\"\")","v":""},null,null,null,null,{"$f":"'3-PAPILLONS'!$C$46","v":"Passage 1"},{"$f":"IF(ISBLANK('3-PAPILLONS'!$C$48),\"\",'3-PAPILLONS'!$C$48)","v":""},{"$f":"IF(ISBLANK('3-PAPILLONS'!$C$50),\"\",'3-PAPILLONS'!$C$50)","v":""},{"$f":"IF(ISBLANK('3-PAPILLONS'!$D$50),\"\",'3-PAPILLONS'!$D$50)","v":""},{"$f":"IF(ISBLANK('3-PAPILLONS'!$C$44),\"\",'3-PAPILLONS'!$C$44)","v":""},{"$f":"IF(ISBLANK('3-PAPILLONS'!$C$47),\"\",'3-PAPILLONS'!$C$47)","v":""},{"$f":"VLOOKUP('compilation données pour export'!$R64,'listes valeurs'!$X$2:$AA$3450,2,FALSE)","v":"Demi-deuil"},{"$f":"'3-PAPILLONS'!$A$18","v":"DEM"},{"$f":"VLOOKUP('compilation données pour export'!$R64,'listes valeurs'!$X$2:$AA$3450,4,FALSE)","v":"Melanargia galathea"},{"$f":"VLOOKUP('compilation données pour export'!$R64,'listes valeurs'!$X$2:$AA$3450,3,FALSE)","v":"Papillons"},"Nombre individus",{"$f":"IF(ISBLANK('3-PAPILLONS'!C$54),\"\",'3-PAPILLONS'!C$54)","v":""},"in",{"$f":"'Synthese Annuelle Monitoring'!$Q$29","v":0}]
[{"$f":"'0-INFOS GENERALES A REMPLIR'!$B$4","v":2021},{"$f":"'0-INFOS GENERALES A REMPLIR'!$B$6","v":0},{"$f":"IF(ISBLANK('0-INFOS GENERALES A REMPLIR'!$E$13),\"\",'0-INFOS GENERALES A REMPLIR'!$E$13)","v":""},{"$f":"IF(ISBLANK('0-INFOS GENERALES A REMPLIR'!$A$13),\"\",'0-INFOS GENERALES A REMPLIR'!$A$13)","v":""},{"$f":"IF(ISBLANK('0-INFOS GENERALES A REMPLIR'!$D$13),\"\",'0-INFOS GENERALES A REMPLIR'!$D$13)","v":""},{"$f":"IFERROR(INDEX('listes valeurs'!F$2:F$552,MATCH(1,('listes valeurs'!B$2:B$552=B65)*('listes valeurs'!E$2:E$552=D65),0)),\"\")","v":""},null,null,null,null,{"$f":"'3-PAPILLONS'!$C$46","v":"Passage 1"},{"$f":"IF(ISBLANK('3-PAPILLONS'!$C$48),\"\",'3-PAPILLONS'!$C$48)","v":""},{"$f":"IF(ISBLANK('3-PAPILLONS'!$C$50),\"\",'3-PAPILLONS'!$C$50)","v":""},{"$f":"IF(ISBLANK('3-PAPILLONS'!$D$50),\"\",'3-PAPILLONS'!$D$50)","v":""},{"$f":"IF(ISBLANK('3-PAPILLONS'!$C$44),\"\",'3-PAPILLONS'!$C$44)","v":""},{"$f":"IF(ISBLANK('3-PAPILLONS'!$C$47),\"\",'3-PAPILLONS'!$C$47)","v":""},{"$f":"VLOOKUP('compilation données pour export'!$R65,'listes valeurs'!$X$2:$AA$3450,2,FALSE)","v":"Demi-deuil"},{"$f":"'3-PAPILLONS'!$A$18","v":"DEM"},{"$f":"VLOOKUP('compilation données pour export'!$R65,'listes valeurs'!$X$2:$AA$3450,4,FALSE)","v":"Melanargia galathea"},{"$f":"VLOOKUP('compilation données pour export'!$R65,'listes valeurs'!$X$2:$AA$3450,3,FALSE)","v":"Papillons"},"Nombre individus",{"$f":"IF(ISBLANK('3-PAPILLONS'!D$54),\"\",'3-PAPILLONS'!D$54)","v":""},"out",{"$f":"'Synthese Annuelle Monitoring'!$Q$29","v":0}]
[{"$f":"'0-INFOS GENERALES A REMPLIR'!$B$4","v":2021},{"$f":"'0-INFOS GENERALES A REMPLIR'!$B$6","v":0},{"$f":"IF(ISBLANK('0-INFOS GENERALES A REMPLIR'!$E$13),\"\",'0-INFOS GENERALES A REMPLIR'!$E$13)","v":""},{"$f":"IF(ISBLANK('0-INFOS GENERALES A REMPLIR'!$A$13),\"\",'0-INFOS GENERALES A REMPLIR'!$A$13)","v":""},{"$f":"IF(ISBLANK('0-INFOS GENERALES A REMPLIR'!$D$13),\"\",'0-INFOS GENERALES A REMPLIR'!$D$13)","v":""},{"$f":"IFERROR(INDEX('listes valeurs'!F$2:F$552,MATCH(1,('listes valeurs'!B$2:B$552=B66)*('listes valeurs'!E$2:E$552=D66),0)),\"\")","v":""},null,null,null,null,{"$f":"'3-PAPILLONS'!$F$46","v":"Passage 2"},{"$f":"IF(ISBLANK('3-PAPILLONS'!$F$48),\"\",'3-PAPILLONS'!$F$48)","v":""},{"$f":"IF(ISBLANK('3-PAPILLONS'!$F$50),\"\",'3-PAPILLONS'!$F$50)","v":""},{"$f":"IF(ISBLANK('3-PAPILLONS'!$G$50),\"\",'3-PAPILLONS'!$G$50)","v":""},{"$f":"IF(ISBLANK('3-PAPILLONS'!$C$44),\"\",'3-PAPILLONS'!$C$44)","v":""},{"$f":"IF(ISBLANK('3-PAPILLONS'!$F$47),\"\",'3-PAPILLONS'!$F$47)","v":""},{"$f":"VLOOKUP('compilation données pour export'!$R66,'listes valeurs'!$X$2:$AA$3450,2,FALSE)","v":"Demi-deuil"},{"$f":"'3-PAPILLONS'!$A$18","v":"DEM"},{"$f":"VLOOKUP('compilation données pour export'!$R66,'listes valeurs'!$X$2:$AA$3450,4,FALSE)","v":"Melanargia galathea"},{"$f":"VLOOKUP('compilation données pour export'!$R66,'listes valeurs'!$X$2:$AA$3450,3,FALSE)","v":"Papillons"},"Nombre individus",{"$f":"IF(ISBLANK('3-PAPILLONS'!F$54),\"\",'3-PAPILLONS'!F$54)","v":""},"in",{"$f":"'Synthese Annuelle Monitoring'!$Q$29","v":0}]
[{"$f":"'0-INFOS GENERALES A REMPLIR'!$B$4","v":2021},{"$f":"'0-INFOS GENERALES A REMPLIR'!$B$6","v":0},{"$f":"IF(ISBLANK('0-INFOS GENERALES A REMPLIR'!$E$13),\"\",'0-INFOS GENERALES A REMPLIR'!$E$13)","v":""},{"$f":"IF(ISBLANK('0-INFOS GENERALES A REMPLIR'!$A$13),\"\",'0-INFOS GENERALES A REMPLIR'!$A$13)","v":""},{"$f":"IF(ISBLANK('0-INFOS GENERALES A REMPLIR'!$D$13),\"\",'0-INFOS GENERALES A REMPLIR'!$D$13)","v":""},{"$f":"IFERROR(INDEX('listes valeurs'!F$2:F$552,MATCH(1,('listes valeurs'!B$2:B$552=B67)*('listes valeurs'!E$2:E$552=D67),0)),\"\")","v":""},null,null,null,null,{"$f":"'3-PAPILLONS'!$F$46","v":"Passage 2"},{"$f":"IF(ISBLANK('3-PAPILLONS'!$F$48),\"\",'3-PAPILLONS'!$F$48)","v":""},{"$f":"IF(ISBLANK('3-PAPILLONS'!$F$50),\"\",'3-PAPILLONS'!$F$50)","v":""},{"$f":"IF(ISBLANK('3-PAPILLONS'!$G$50),\"\",'3-PAPILLONS'!$G$50)","v":""},{"$f":"IF(ISBLANK('3-PAPILLONS'!$C$44),\"\",'3-PAPILLONS'!$C$44)","v":""},{"$f":"IF(ISBLANK('3-PAPILLONS'!$F$47),\"\",'3-PAPILLONS'!$F$47)","v":""},{"$f":"VLOOKUP('compilation données pour export'!$R67,'listes valeurs'!$X$2:$AA$3450,2,FALSE)","v":"Demi-deuil"},{"$f":"'3-PAPILLONS'!$A$18","v":"DEM"},{"$f":"VLOOKUP('compilation données pour export'!$R67,'listes valeurs'!$X$2:$AA$3450,4,FALSE)","v":"Melanargia galathea"},{"$f":"VLOOKUP('compilation données pour export'!$R67,'listes valeurs'!$X$2:$AA$3450,3,FALSE)","v":"Papillons"},"Nombre individus",{"$f":"IF(ISBLANK('3-PAPILLONS'!G$54),\"\",'3-PAPILLONS'!G$54)","v":""},"out",{"$f":"'Synthese Annuelle Monitoring'!$Q$29","v":0}]
[{"$f":"'0-INFOS GENERALES A REMPLIR'!$B$4","v":2021},{"$f":"'0-INFOS GENERALES A REMPLIR'!$B$6","v":0},{"$f":"IF(ISBLANK('0-INFOS GENERALES A REMPLIR'!$E$14),\"\",'0-INFOS GENERALES A REMPLIR'!$E$14)","v":""},{"$f":"IF(ISBLANK('0-INFOS GENERALES A REMPLIR'!$A$14),\"\",'0-INFOS GENERALES A REMPLIR'!$A$14)","v":""},{"$f":"IF(ISBLANK('0-INFOS GENERALES A REMPLIR'!$D$14),\"\",'0-INFOS GENERALES A REMPLIR'!$D$14)","v":""},{"$f":"IFERROR(INDEX('listes valeurs'!F$2:F$552,MATCH(1,('listes valeurs'!B$2:B$552=B68)*('listes valeurs'!E$2:E$552=D68),0)),\"\")","v":""},null,null,null,null,{"$f":"'3-PAPILLONS'!$C$82","v":"Passage 1"},{"$f":"IF(ISBLANK('3-PAPILLONS'!$C$84),\"\",'3-PAPILLONS'!$C$84)","v":""},{"$f":"IF(ISBLANK('3-PAPILLONS'!$C$86),\"\",'3-PAPILLONS'!$C$86)","v":""},{"$f":"IF(ISBLANK('3-PAPILLONS'!$D$86),\"\",'3-PAPILLONS'!$D$86)","v":""},{"$f":"IF(ISBLANK('3-PAPILLONS'!$C$80),\"\",'3-PAPILLONS'!$C$80)","v":""},{"$f":"IF(ISBLANK('3-PAPILLONS'!$C$83),\"\",'3-PAPILLONS'!$C$83)","v":""},{"$f":"VLOOKUP('compilation données pour export'!$R68,'listes valeurs'!$X$2:$AA$3450,2,FALSE)","v":"Demi-deuil"},{"$f":"'3-PAPILLONS'!$A$18","v":"DEM"},{"$f":"VLOOKUP('compilation données pour export'!$R68,'listes valeurs'!$X$2:$AA$3450,4,FALSE)","v":"Melanargia galathea"},{"$f":"VLOOKUP('compilation données pour export'!$R68,'listes valeurs'!$X$2:$AA$3450,3,FALSE)","v":"Papillons"},"Nombre individus",{"$f":"IF(ISBLANK('3-PAPILLONS'!C$90),\"\",'3-PAPILLONS'!C$90)","v":""},"in",{"$f":"'Synthese Annuelle Monitoring'!$Q$29","v":0}]
[{"$f":"'0-INFOS GENERALES A REMPLIR'!$B$4","v":2021},{"$f":"'0-INFOS GENERALES A REMPLIR'!$B$6","v":0},{"$f":"IF(ISBLANK('0-INFOS GENERALES A REMPLIR'!$E$14),\"\",'0-INFOS GENERALES A REMPLIR'!$E$14)","v":""},{"$f":"IF(ISBLANK('0-INFOS GENERALES A REMPLIR'!$A$14),\"\",'0-INFOS GENERALES A REMPLIR'!$A$14)","v":""},{"$f":"IF(ISBLANK('0-INFOS GENERALES A REMPLIR'!$D$14),\"\",'0-INFOS GENERALES A REMPLIR'!$D$14)","v":""},{"$f":"IFERROR(INDEX('listes valeurs'!F$2:F$552,MATCH(1,('listes valeurs'!B$2:B$552=B69)*('listes valeurs'!E$2:E$552=D69),0)),\"\")","v":""},null,null,null,null,{"$f":"'3-PAPILLONS'!$C$82","v":"Passage 1"},{"$f":"IF(ISBLANK('3-PAPILLONS'!$C$84),\"\",'3-PAPILLONS'!$C$84)","v":""},{"$f":"IF(ISBLANK('3-PAPILLONS'!$C$86),\"\",'3-PAPILLONS'!$C$86)","v":""},{"$f":"IF(ISBLANK('3-PAPILLONS'!$D$86),\"\",'3-PAPILLONS'!$D$86)","v":""},{"$f":"IF(ISBLANK('3-PAPILLONS'!$C$80),\"\",'3-PAPILLONS'!$C$80)","v":""},{"$f":"IF(ISBLANK('3-PAPILLONS'!$C$83),\"\",'3-PAPILLONS'!$C$83)","v":""},{"$f":"VLOOKUP('compilation données pour export'!$R69,'listes valeurs'!$X$2:$AA$3450,2,FALSE)","v":"Demi-deuil"},{"$f":"'3-PAPILLONS'!$A$18","v":"DEM"},{"$f":"VLOOKUP('compilation données pour export'!$R69,'listes valeurs'!$X$2:$AA$3450,4,FALSE)","v":"Melanargia galathea"},{"$f":"VLOOKUP('compilation données pour export'!$R69,'listes valeurs'!$X$2:$AA$3450,3,FALSE)","v":"Papillons"},"Nombre individus",{"$f":"IF(ISBLANK('3-PAPILLONS'!D$90),\"\",'3-PAPILLONS'!D$90)","v":""},"out",{"$f":"'Synthese Annuelle Monitoring'!$Q$29","v":0}]
[{"$f":"'0-INFOS GENERALES A REMPLIR'!$B$4","v":2021},{"$f":"'0-INFOS GENERALES A REMPLIR'!$B$6","v":0},{"$f":"IF(ISBLANK('0-INFOS GENERALES A REMPLIR'!$E$14),\"\",'0-INFOS GENERALES A REMPLIR'!$E$14)","v":""},{"$f":"IF(ISBLANK('0-INFOS GENERALES A REMPLIR'!$A$14),\"\",'0-INFOS GENERALES A REMPLIR'!$A$14)","v":""},{"$f":"IF(ISBLANK('0-INFOS GENERALES A REMPLIR'!$D$14),\"\",'0-INFOS GENERALES A REMPLIR'!$D$14)","v":""},{"$f":"IFERROR(INDEX('listes valeurs'!F$2:F$552,MATCH(1,('listes valeurs'!B$2:B$552=B70)*('listes valeurs'!E$2:E$552=D70),0)),\"\")","v":""},null,null,null,null,{"$f":"'3-PAPILLONS'!$F$82","v":"Passage 2"},{"$f":"IF(ISBLANK('3-PAPILLONS'!$F$84),\"\",'3-PAPILLONS'!$F$84)","v":""},{"$f":"IF(ISBLANK('3-PAPILLONS'!$F$86),\"\",'3-PAPILLONS'!$F$86)","v":""},{"$f":"IF(ISBLANK('3-PAPILLONS'!$G$86),\"\",'3-PAPILLONS'!$G$86)","v":""},{"$f":"IF(ISBLANK('3-PAPILLONS'!$C$80),\"\",'3-PAPILLONS'!$C$80)","v":""},{"$f":"IF(ISBLANK('3-PAPILLONS'!$F$83),\"\",'3-PAPILLONS'!$F$83)","v":""},{"$f":"VLOOKUP('compilation données pour export'!$R70,'listes valeurs'!$X$2:$AA$3450,2,FALSE)","v":"Demi-deuil"},{"$f":"'3-PAPILLONS'!$A$18","v":"DEM"},{"$f":"VLOOKUP('compilation données pour export'!$R70,'listes valeurs'!$X$2:$AA$3450,4,FALSE)","v":"Melanargia galathea"},{"$f":"VLOOKUP('compilation données pour export'!$R70,'listes valeurs'!$X$2:$AA$3450,3,FALSE)","v":"Papillons"},"Nombre individus",{"$f":"IF(ISBLANK('3-PAPILLONS'!F$90),\"\",'3-PAPILLONS'!F$90)","v":""},"in",{"$f":"'Synthese Annuelle Monitoring'!$Q$29","v":0}]
[{"$f":"'0-INFOS GENERALES A REMPLIR'!$B$4","v":2021},{"$f":"'0-INFOS GENERALES A REMPLIR'!$B$6","v":0},{"$f":"IF(ISBLANK('0-INFOS GENERALES A REMPLIR'!$E$14),\"\",'0-INFOS GENERALES A REMPLIR'!$E$14)","v":""},{"$f":"IF(ISBLANK('0-INFOS GENERALES A REMPLIR'!$A$14),\"\",'0-INFOS GENERALES A REMPLIR'!$A$14)","v":""},{"$f":"IF(ISBLANK('0-INFOS GENERALES A REMPLIR'!$D$14),\"\",'0-INFOS GENERALES A REMPLIR'!$D$14)","v":""},{"$f":"IFERROR(INDEX('listes valeurs'!F$2:F$552,MATCH(1,('listes valeurs'!B$2:B$552=B71)*('listes valeurs'!E$2:E$552=D71),0)),\"\")","v":""},null,null,null,null,{"$f":"'3-PAPILLONS'!$F$82","v":"Passage 2"},{"$f":"IF(ISBLANK('3-PAPILLONS'!$F$84),\"\",'3-PAPILLONS'!$F$84)","v":""},{"$f":"IF(ISBLANK('3-PAPILLONS'!$F$86),\"\",'3-PAPILLONS'!$F$86)","v":""},{"$f":"IF(ISBLANK('3-PAPILLONS'!$G$86),\"\",'3-PAPILLONS'!$G$86)","v":""},{"$f":"IF(ISBLANK('3-PAPILLONS'!$C$80),\"\",'3-PAPILLONS'!$C$80)","v":""},{"$f":"IF(ISBLANK('3-PAPILLONS'!$F$83),\"\",'3-PAPILLONS'!$F$83)","v":""},{"$f":"VLOOKUP('compilation données pour export'!$R71,'listes valeurs'!$X$2:$AA$3450,2,FALSE)","v":"Demi-deuil"},{"$f":"'3-PAPILLONS'!$A$18","v":"DEM"},{"$f":"VLOOKUP('compilation données pour export'!$R71,'listes valeurs'!$X$2:$AA$3450,4,FALSE)","v":"Melanargia galathea"},{"$f":"VLOOKUP('compilation données pour export'!$R71,'listes valeurs'!$X$2:$AA$3450,3,FALSE)","v":"Papillons"},"Nombre individus",{"$f":"IF(ISBLANK('3-PAPILLONS'!G$90),\"\",'3-PAPILLONS'!G$90)","v":""},"out",{"$f":"'Synthese Annuelle Monitoring'!$Q$29","v":0}]
[{"$f":"'0-INFOS GENERALES A REMPLIR'!$B$4","v":2021},{"$f":"'0-INFOS GENERALES A REMPLIR'!$B$6","v":0},{"$f":"IF(ISBLANK('0-INFOS GENERALES A REMPLIR'!$E$15),\"\",'0-INFOS GENERALES A REMPLIR'!$E$15)","v":""},{"$f":"IF(ISBLANK('0-INFOS GENERALES A REMPLIR'!$A$15),\"\",'0-INFOS GENERALES A REMPLIR'!$A$15)","v":""},{"$f":"IF(ISBLANK('0-INFOS GENERALES A REMPLIR'!$D$15),\"\",'0-INFOS GENERALES A REMPLIR'!$D$15)","v":""},{"$f":"IFERROR(INDEX('listes valeurs'!F$2:F$552,MATCH(1,('listes valeurs'!B$2:B$552=B72)*('listes valeurs'!E$2:E$552=D72),0)),\"\")","v":""},null,null,null,null,{"$f":"'3-PAPILLONS'!$C$118","v":"Passage 1"},{"$f":"IF(ISBLANK('3-PAPILLONS'!$C$120),\"\",'3-PAPILLONS'!$C$120)","v":""},{"$f":"IF(ISBLANK('3-PAPILLONS'!$C$122),\"\",'3-PAPILLONS'!$C$122)","v":""},{"$f":"IF(ISBLANK('3-PAPILLONS'!$D$122),\"\",'3-PAPILLONS'!$D$122)","v":""},{"$f":"IF(ISBLANK('3-PAPILLONS'!$C$116),\"\",'3-PAPILLONS'!$C$116)","v":""},{"$f":"IF(ISBLANK('3-PAPILLONS'!$C$119),\"\",'3-PAPILLONS'!$C$119)","v":""},{"$f":"VLOOKUP('compilation données pour export'!$R72,'listes valeurs'!$X$2:$AA$3450,2,FALSE)","v":"Demi-deuil"},{"$f":"'3-PAPILLONS'!$A$18","v":"DEM"},{"$f":"VLOOKUP('compilation données pour export'!$R72,'listes valeurs'!$X$2:$AA$3450,4,FALSE)","v":"Melanargia galathea"},{"$f":"VLOOKUP('compilation données pour export'!$R72,'listes valeurs'!$X$2:$AA$3450,3,FALSE)","v":"Papillons"},"Nombre individus",{"$f":"IF(ISBLANK('3-PAPILLONS'!C$126),\"\",'3-PAPILLONS'!C$126)","v":""},"in",{"$f":"'Synthese Annuelle Monitoring'!$Q$29","v":0}]
[{"$f":"'0-INFOS GENERALES A REMPLIR'!$B$4","v":2021},{"$f":"'0-INFOS GENERALES A REMPLIR'!$B$6","v":0},{"$f":"IF(ISBLANK('0-INFOS GENERALES A REMPLIR'!$E$15),\"\",'0-INFOS GENERALES A REMPLIR'!$E$15)","v":""},{"$f":"IF(ISBLANK('0-INFOS GENERALES A REMPLIR'!$A$15),\"\",'0-INFOS GENERALES A REMPLIR'!$A$15)","v":""},{"$f":"IF(ISBLANK('0-INFOS GENERALES A REMPLIR'!$D$15),\"\",'0-INFOS GENERALES A REMPLIR'!$D$15)","v":""},{"$f":"IFERROR(INDEX('listes valeurs'!F$2:F$552,MATCH(1,('listes valeurs'!B$2:B$552=B73)*('listes valeurs'!E$2:E$552=D73),0)),\"\")","v":""},null,null,null,null,{"$f":"'3-PAPILLONS'!$C$118","v":"Passage 1"},{"$f":"IF(ISBLANK('3-PAPILLONS'!$C$120),\"\",'3-PAPILLONS'!$C$120)","v":""},{"$f":"IF(ISBLANK('3-PAPILLONS'!$C$122),\"\",'3-PAPILLONS'!$C$122)","v":""},{"$f":"IF(ISBLANK('3-PAPILLONS'!$D$122),\"\",'3-PAPILLONS'!$D$122)","v":""},{"$f":"IF(ISBLANK('3-PAPILLONS'!$C$116),\"\",'3-PAPILLONS'!$C$116)","v":""},{"$f":"IF(ISBLANK('3-PAPILLONS'!$C$119),\"\",'3-PAPILLONS'!$C$119)","v":""},{"$f":"VLOOKUP('compilation données pour export'!$R73,'listes valeurs'!$X$2:$AA$3450,2,FALSE)","v":"Demi-deuil"},{"$f":"'3-PAPILLONS'!$A$18","v":"DEM"},{"$f":"VLOOKUP('compilation données pour export'!$R73,'listes valeurs'!$X$2:$AA$3450,4,FALSE)","v":"Melanargia galathea"},{"$f":"VLOOKUP('compilation données pour export'!$R73,'listes valeurs'!$X$2:$AA$3450,3,FALSE)","v":"Papillons"},"Nombre individus",{"$f":"IF(ISBLANK('3-PAPILLONS'!D$126),\"\",'3-PAPILLONS'!D$126)","v":""},"out",{"$f":"'Synthese Annuelle Monitoring'!$Q$29","v":0}]
[{"$f":"'0-INFOS GENERALES A REMPLIR'!$B$4","v":2021},{"$f":"'0-INFOS GENERALES A REMPLIR'!$B$6","v":0},{"$f":"IF(ISBLANK('0-INFOS GENERALES A REMPLIR'!$E$15),\"\",'0-INFOS GENERALES A REMPLIR'!$E$15)","v":""},{"$f":"IF(ISBLANK('0-INFOS GENERALES A REMPLIR'!$A$15),\"\",'0-INFOS GENERALES A REMPLIR'!$A$15)","v":""},{"$f":"IF(ISBLANK('0-INFOS GENERALES A REMPLIR'!$D$15),\"\",'0-INFOS GENERALES A REMPLIR'!$D$15)","v":""},{"$f":"IFERROR(INDEX('listes valeurs'!F$2:F$552,MATCH(1,('listes valeurs'!B$2:B$552=B74)*('listes valeurs'!E$2:E$552=D74),0)),\"\")","v":""},null,null,null,null,{"$f":"'3-PAPILLONS'!$F$118","v":"Passage 2"},{"$f":"IF(ISBLANK('3-PAPILLONS'!$F$120),\"\",'3-PAPILLONS'!$F$120)","v":""},{"$f":"IF(ISBLANK('3-PAPILLONS'!$F$122),\"\",'3-PAPILLONS'!$F$122)","v":""},{"$f":"IF(ISBLANK('3-PAPILLONS'!$G$122),\"\",'3-PAPILLONS'!$G$122)","v":""},{"$f":"IF(ISBLANK('3-PAPILLONS'!$C$116),\"\",'3-PAPILLONS'!$C$116)","v":""},{"$f":"IF(ISBLANK('3-PAPILLONS'!$F$119),\"\",'3-PAPILLONS'!$F$119)","v":""},{"$f":"VLOOKUP('compilation données pour export'!$R74,'listes valeurs'!$X$2:$AA$3450,2,FALSE)","v":"Demi-deuil"},{"$f":"'3-PAPILLONS'!$A$18","v":"DEM"},{"$f":"VLOOKUP('compilation données pour export'!$R74,'listes valeurs'!$X$2:$AA$3450,4,FALSE)","v":"Melanargia galathea"},{"$f":"VLOOKUP('compilation données pour export'!$R74,'listes valeurs'!$X$2:$AA$3450,3,FALSE)","v":"Papillons"},"Nombre individus",{"$f":"IF(ISBLANK('3-PAPILLONS'!F$126),\"\",'3-PAPILLONS'!F$126)","v":""},"in",{"$f":"'Synthese Annuelle Monitoring'!$Q$29","v":0}]
[{"$f":"'0-INFOS GENERALES A REMPLIR'!$B$4","v":2021},{"$f":"'0-INFOS GENERALES A REMPLIR'!$B$6","v":0},{"$f":"IF(ISBLANK('0-INFOS GENERALES A REMPLIR'!$E$15),\"\",'0-INFOS GENERALES A REMPLIR'!$E$15)","v":""},{"$f":"IF(ISBLANK('0-INFOS GENERALES A REMPLIR'!$A$15),\"\",'0-INFOS GENERALES A REMPLIR'!$A$15)","v":""},{"$f":"IF(ISBLANK('0-INFOS GENERALES A REMPLIR'!$D$15),\"\",'0-INFOS GENERALES A REMPLIR'!$D$15)","v":""},{"$f":"IFERROR(INDEX('listes valeurs'!F$2:F$552,MATCH(1,('listes valeurs'!B$2:B$552=B75)*('listes valeurs'!E$2:E$552=D75),0)),\"\")","v":""},null,null,null,null,{"$f":"'3-PAPILLONS'!$F$118","v":"Passage 2"},{"$f":"IF(ISBLANK('3-PAPILLONS'!$F$120),\"\",'3-PAPILLONS'!$F$120)","v":""},{"$f":"IF(ISBLANK('3-PAPILLONS'!$F$122),\"\",'3-PAPILLONS'!$F$122)","v":""},{"$f":"IF(ISBLANK('3-PAPILLONS'!$G$122),\"\",'3-PAPILLONS'!$G$122)","v":""},{"$f":"IF(ISBLANK('3-PAPILLONS'!$C$116),\"\",'3-PAPILLONS'!$C$116)","v":""},{"$f":"IF(ISBLANK('3-PAPILLONS'!$F$119),\"\",'3-PAPILLONS'!$F$119)","v":""},{"$f":"VLOOKUP('compilation données pour export'!$R75,'listes valeurs'!$X$2:$AA$3450,2,FALSE)","v":"Demi-deuil"},{"$f":"'3-PAPILLONS'!$A$18","v":"DEM"},{"$f":"VLOOKUP('compilation données pour export'!$R75,'listes valeurs'!$X$2:$AA$3450,4,FALSE)","v":"Melanargia galathea"},{"$f":"VLOOKUP('compilation données pour export'!$R75,'listes valeurs'!$X$2:$AA$3450,3,FALSE)","v":"Papillons"},"Nombre individus",{"$f":"IF(ISBLANK('3-PAPILLONS'!G$126),\"\",'3-PAPILLONS'!G$126)","v":""},"out",{"$f":"'Synthese Annuelle Monitoring'!$Q$29","v":0}]
[{"$f":"'0-INFOS GENERALES A REMPLIR'!$B$4","v":2021},{"$f":"'0-INFOS GENERALES A REMPLIR'!$B$6","v":0},{"$f":"IF(ISBLANK('0-INFOS GENERALES A REMPLIR'!$E$16),\"\",'0-INFOS GENERALES A REMPLIR'!$E$16)","v":""},{"$f":"IF(ISBLANK('0-INFOS GENERALES A REMPLIR'!$A$16),\"\",'0-INFOS GENERALES A REMPLIR'!$A$16)","v":""},{"$f":"IF(ISBLANK('0-INFOS GENERALES A REMPLIR'!$D$16),\"\",'0-INFOS GENERALES A REMPLIR'!$D$16)","v":""},{"$f":"IFERROR(INDEX('listes valeurs'!F$2:F$552,MATCH(1,('listes valeurs'!B$2:B$552=B76)*('listes valeurs'!E$2:E$552=D76),0)),\"\")","v":""},null,null,null,null,{"$f":"'3-PAPILLONS'!$C$154","v":"Passage 1"},{"$f":"IF(ISBLANK('3-PAPILLONS'!$C$156),\"\",'3-PAPILLONS'!$C$156)","v":""},{"$f":"IF(ISBLANK('3-PAPILLONS'!$C$158),\"\",'3-PAPILLONS'!$C$158)","v":""},{"$f":"IF(ISBLANK('3-PAPILLONS'!$D$158),\"\",'3-PAPILLONS'!$D$158)","v":""},{"$f":"IF(ISBLANK('3-PAPILLONS'!$C$152),\"\",'3-PAPILLONS'!$C$152)","v":""},{"$f":"IF(ISBLANK('3-PAPILLONS'!$C$155),\"\",'3-PAPILLONS'!$C$155)","v":""},{"$f":"VLOOKUP('compilation données pour export'!$R76,'listes valeurs'!$X$2:$AA$3450,2,FALSE)","v":"Demi-deuil"},{"$f":"'3-PAPILLONS'!$A$18","v":"DEM"},{"$f":"VLOOKUP('compilation données pour export'!$R76,'listes valeurs'!$X$2:$AA$3450,4,FALSE)","v":"Melanargia galathea"},{"$f":"VLOOKUP('compilation données pour export'!$R76,'listes valeurs'!$X$2:$AA$3450,3,FALSE)","v":"Papillons"},"Nombre individus",{"$f":"IF(ISBLANK('3-PAPILLONS'!C$162),\"\",'3-PAPILLONS'!C$162)","v":""},"in",{"$f":"'Synthese Annuelle Monitoring'!$Q$29","v":0}]
[{"$f":"'0-INFOS GENERALES A REMPLIR'!$B$4","v":2021},{"$f":"'0-INFOS GENERALES A REMPLIR'!$B$6","v":0},{"$f":"IF(ISBLANK('0-INFOS GENERALES A REMPLIR'!$E$16),\"\",'0-INFOS GENERALES A REMPLIR'!$E$16)","v":""},{"$f":"IF(ISBLANK('0-INFOS GENERALES A REMPLIR'!$A$16),\"\",'0-INFOS GENERALES A REMPLIR'!$A$16)","v":""},{"$f":"IF(ISBLANK('0-INFOS GENERALES A REMPLIR'!$D$16),\"\",'0-INFOS GENERALES A REMPLIR'!$D$16)","v":""},{"$f":"IFERROR(INDEX('listes valeurs'!F$2:F$552,MATCH(1,('listes valeurs'!B$2:B$552=B77)*('listes valeurs'!E$2:E$552=D77),0)),\"\")","v":""},null,null,null,null,{"$f":"'3-PAPILLONS'!$C$154","v":"Passage 1"},{"$f":"IF(ISBLANK('3-PAPILLONS'!$C$156),\"\",'3-PAPILLONS'!$C$156)","v":""},{"$f":"IF(ISBLANK('3-PAPILLONS'!$C$158),\"\",'3-PAPILLONS'!$C$158)","v":""},{"$f":"IF(ISBLANK('3-PAPILLONS'!$D$158),\"\",'3-PAPILLONS'!$D$158)","v":""},{"$f":"IF(ISBLANK('3-PAPILLONS'!$C$152),\"\",'3-PAPILLONS'!$C$152)","v":""},{"$f":"IF(ISBLANK('3-PAPILLONS'!$C$155),\"\",'3-PAPILLONS'!$C$155)","v":""},{"$f":"VLOOKUP('compilation données pour export'!$R77,'listes valeurs'!$X$2:$AA$3450,2,FALSE)","v":"Demi-deuil"},{"$f":"'3-PAPILLONS'!$A$18","v":"DEM"},{"$f":"VLOOKUP('compilation données pour export'!$R77,'listes valeurs'!$X$2:$AA$3450,4,FALSE)","v":"Melanargia galathea"},{"$f":"VLOOKUP('compilation données pour export'!$R77,'listes valeurs'!$X$2:$AA$3450,3,FALSE)","v":"Papillons"},"Nombre individus",{"$f":"IF(ISBLANK('3-PAPILLONS'!D$162),\"\",'3-PAPILLONS'!D$162)","v":""},"out",{"$f":"'Synthese Annuelle Monitoring'!$Q$29","v":0}]
[{"$f":"'0-INFOS GENERALES A REMPLIR'!$B$4","v":2021},{"$f":"'0-INFOS GENERALES A REMPLIR'!$B$6","v":0},{"$f":"IF(ISBLANK('0-INFOS GENERALES A REMPLIR'!$E$16),\"\",'0-INFOS GENERALES A REMPLIR'!$E$16)","v":""},{"$f":"IF(ISBLANK('0-INFOS GENERALES A REMPLIR'!$A$16),\"\",'0-INFOS GENERALES A REMPLIR'!$A$16)","v":""},{"$f":"IF(ISBLANK('0-INFOS GENERALES A REMPLIR'!$D$16),\"\",'0-INFOS GENERALES A REMPLIR'!$D$16)","v":""},{"$f":"IFERROR(INDEX('listes valeurs'!F$2:F$552,MATCH(1,('listes valeurs'!B$2:B$552=B78)*('listes valeurs'!E$2:E$552=D78),0)),\"\")","v":""},null,null,null,null,{"$f":"'3-PAPILLONS'!$F$154","v":"Passage 2"},{"$f":"IF(ISBLANK('3-PAPILLONS'!$F$156),\"\",'3-PAPILLONS'!$F$156)","v":""},{"$f":"IF(ISBLANK('3-PAPILLONS'!$F$158),\"\",'3-PAPILLONS'!$F$158)","v":""},{"$f":"IF(ISBLANK('3-PAPILLONS'!$G$158),\"\",'3-PAPILLONS'!$G$158)","v":""},{"$f":"IF(ISBLANK('3-PAPILLONS'!$C$152),\"\",'3-PAPILLONS'!$C$152)","v":""},{"$f":"IF(ISBLANK('3-PAPILLONS'!$F$155),\"\",'3-PAPILLONS'!$F$155)","v":""},{"$f":"VLOOKUP('compilation données pour export'!$R78,'listes valeurs'!$X$2:$AA$3450,2,FALSE)","v":"Demi-deuil"},{"$f":"'3-PAPILLONS'!$A$18","v":"DEM"},{"$f":"VLOOKUP('compilation données pour export'!$R78,'listes valeurs'!$X$2:$AA$3450,4,FALSE)","v":"Melanargia galathea"},{"$f":"VLOOKUP('compilation données pour export'!$R78,'listes valeurs'!$X$2:$AA$3450,3,FALSE)","v":"Papillons"},"Nombre individus",{"$f":"IF(ISBLANK('3-PAPILLONS'!F$162),\"\",'3-PAPILLONS'!F$162)","v":""},"in",{"$f":"'Synthese Annuelle Monitoring'!$Q$29","v":0}]
[{"$f":"'0-INFOS GENERALES A REMPLIR'!$B$4","v":2021},{"$f":"'0-INFOS GENERALES A REMPLIR'!$B$6","v":0},{"$f":"IF(ISBLANK('0-INFOS GENERALES A REMPLIR'!$E$16),\"\",'0-INFOS GENERALES A REMPLIR'!$E$16)","v":""},{"$f":"IF(ISBLANK('0-INFOS GENERALES A REMPLIR'!$A$16),\"\",'0-INFOS GENERALES A REMPLIR'!$A$16)","v":""},{"$f":"IF(ISBLANK('0-INFOS GENERALES A REMPLIR'!$D$16),\"\",'0-INFOS GENERALES A REMPLIR'!$D$16)","v":""},{"$f":"IFERROR(INDEX('listes valeurs'!F$2:F$552,MATCH(1,('listes valeurs'!B$2:B$552=B79)*('listes valeurs'!E$2:E$552=D79),0)),\"\")","v":""},null,null,null,null,{"$f":"'3-PAPILLONS'!$F$154","v":"Passage 2"},{"$f":"IF(ISBLANK('3-PAPILLONS'!$F$156),\"\",'3-PAPILLONS'!$F$156)","v":""},{"$f":"IF(ISBLANK('3-PAPILLONS'!$F$158),\"\",'3-PAPILLONS'!$F$158)","v":""},{"$f":"IF(ISBLANK('3-PAPILLONS'!$G$158),\"\",'3-PAPILLONS'!$G$158)","v":""},{"$f":"IF(ISBLANK('3-PAPILLONS'!$C$152),\"\",'3-PAPILLONS'!$C$152)","v":""},{"$f":"IF(ISBLANK('3-PAPILLONS'!$F$155),\"\",'3-PAPILLONS'!$F$155)","v":""},{"$f":"VLOOKUP('compilation données pour export'!$R79,'listes valeurs'!$X$2:$AA$3450,2,FALSE)","v":"Demi-deuil"},{"$f":"'3-PAPILLONS'!$A$18","v":"DEM"},{"$f":"VLOOKUP('compilation données pour export'!$R79,'listes valeurs'!$X$2:$AA$3450,4,FALSE)","v":"Melanargia galathea"},{"$f":"VLOOKUP('compilation données pour export'!$R79,'listes valeurs'!$X$2:$AA$3450,3,FALSE)","v":"Papillons"},"Nombre individus",{"$f":"IF(ISBLANK('3-PAPILLONS'!G$162),\"\",'3-PAPILLONS'!G$162)","v":""},"out",{"$f":"'Synthese Annuelle Monitoring'!$Q$29","v":0}]
[{"$f":"'0-INFOS GENERALES A REMPLIR'!$B$4","v":2021},{"$f":"'0-INFOS GENERALES A REMPLIR'!$B$6","v":0},{"$f":"IF(ISBLANK('0-INFOS GENERALES A REMPLIR'!$E$12),\"\",'0-INFOS GENERALES A REMPLIR'!$E$12)","v":""},{"$f":"IF(ISBLANK('0-INFOS GENERALES A REMPLIR'!$A$12),\"\",'0-INFOS GENERALES A REMPLIR'!$A$12)","v":""},{"$f":"IF(ISBLANK('0-INFOS GENERALES A REMPLIR'!$D$12),\"\",'0-INFOS GENERALES A REMPLIR'!$D$12)","v":""},{"$f":"IFERROR(INDEX('listes valeurs'!F$2:F$552,MATCH(1,('listes valeurs'!B$2:B$552=B80)*('listes valeurs'!E$2:E$552=D80),0)),\"\")","v":""},null,null,null,null,{"$f":"'3-PAPILLONS'!$C$10","v":"Passage 1"},{"$f":"IF(ISBLANK('3-PAPILLONS'!$C$12),\"\",'3-PAPILLONS'!$C$12)","v":""},{"$f":"IF(ISBLANK('3-PAPILLONS'!$C$14),\"\",'3-PAPILLONS'!$C$14)","v":""},{"$f":"IF(ISBLANK('3-PAPILLONS'!$D$14),\"\",'3-PAPILLONS'!$D$14)","v":""},{"$f":"IF(ISBLANK('3-PAPILLONS'!$C$8),\"\",'3-PAPILLONS'!$C$8)","v":""},{"$f":"IF(ISBLANK('3-PAPILLONS'!$C$11),\"\",'3-PAPILLONS'!$C$11)","v":""},{"$f":"VLOOKUP('compilation données pour export'!$R80,'listes valeurs'!$X$2:$AA$3450,2,FALSE)","v":"Myrtil"},{"$f":"'3-PAPILLONS'!$A$19","v":"MYR"},{"$f":"VLOOKUP('compilation données pour export'!$R80,'listes valeurs'!$X$2:$AA$3450,4,FALSE)","v":"Maniola jurtina"},{"$f":"VLOOKUP('compilation données pour export'!$R80,'listes valeurs'!$X$2:$AA$3450,3,FALSE)","v":"Papillons"},"Nombre individus",{"$f":"IF(ISBLANK('3-PAPILLONS'!C$19),\"\",'3-PAPILLONS'!C$19)","v":""},"in",{"$f":"'Synthese Annuelle Monitoring'!$Q$30","v":0}]
[{"$f":"'0-INFOS GENERALES A REMPLIR'!$B$4","v":2021},{"$f":"'0-INFOS GENERALES A REMPLIR'!$B$6","v":0},{"$f":"IF(ISBLANK('0-INFOS GENERALES A REMPLIR'!$E$12),\"\",'0-INFOS GENERALES A REMPLIR'!$E$12)","v":""},{"$f":"IF(ISBLANK('0-INFOS GENERALES A REMPLIR'!$A$12),\"\",'0-INFOS GENERALES A REMPLIR'!$A$12)","v":""},{"$f":"IF(ISBLANK('0-INFOS GENERALES A REMPLIR'!$D$12),\"\",'0-INFOS GENERALES A REMPLIR'!$D$12)","v":""},{"$f":"IFERROR(INDEX('listes valeurs'!F$2:F$552,MATCH(1,('listes valeurs'!B$2:B$552=B81)*('listes valeurs'!E$2:E$552=D81),0)),\"\")","v":""},null,null,null,null,{"$f":"'3-PAPILLONS'!$C$10","v":"Passage 1"},{"$f":"IF(ISBLANK('3-PAPILLONS'!$C$12),\"\",'3-PAPILLONS'!$C$12)","v":""},{"$f":"IF(ISBLANK('3-PAPILLONS'!$C$14),\"\",'3-PAPILLONS'!$C$14)","v":""},{"$f":"IF(ISBLANK('3-PAPILLONS'!$D$14),\"\",'3-PAPILLONS'!$D$14)","v":""},{"$f":"IF(ISBLANK('3-PAPILLONS'!$C$8),\"\",'3-PAPILLONS'!$C$8)","v":""},{"$f":"IF(ISBLANK('3-PAPILLONS'!$C$11),\"\",'3-PAPILLONS'!$C$11)","v":""},{"$f":"VLOOKUP('compilation données pour export'!$R81,'listes valeurs'!$X$2:$AA$3450,2,FALSE)","v":"Myrtil"},{"$f":"'3-PAPILLONS'!$A$19","v":"MYR"},{"$f":"VLOOKUP('compilation données pour export'!$R81,'listes valeurs'!$X$2:$AA$3450,4,FALSE)","v":"Maniola jurtina"},{"$f":"VLOOKUP('compilation données pour export'!$R81,'listes valeurs'!$X$2:$AA$3450,3,FALSE)","v":"Papillons"},"Nombre individus",{"$f":"IF(ISBLANK('3-PAPILLONS'!D$19),\"\",'3-PAPILLONS'!D$19)","v":""},"out",{"$f":"'Synthese Annuelle Monitoring'!$Q$30","v":0}]
[{"$f":"'0-INFOS GENERALES A REMPLIR'!$B$4","v":2021},{"$f":"'0-INFOS GENERALES A REMPLIR'!$B$6","v":0},{"$f":"IF(ISBLANK('0-INFOS GENERALES A REMPLIR'!$E$12),\"\",'0-INFOS GENERALES A REMPLIR'!$E$12)","v":""},{"$f":"IF(ISBLANK('0-INFOS GENERALES A REMPLIR'!$A$12),\"\",'0-INFOS GENERALES A REMPLIR'!$A$12)","v":""},{"$f":"IF(ISBLANK('0-INFOS GENERALES A REMPLIR'!$D$12),\"\",'0-INFOS GENERALES A REMPLIR'!$D$12)","v":""},{"$f":"IFERROR(INDEX('listes valeurs'!F$2:F$552,MATCH(1,('listes valeurs'!B$2:B$552=B82)*('listes valeurs'!E$2:E$552=D82),0)),\"\")","v":""},null,null,null,null,{"$f":"'3-PAPILLONS'!$F$10","v":"Passage 2"},{"$f":"IF(ISBLANK('3-PAPILLONS'!$F$12),\"\",'3-PAPILLONS'!$F$12)","v":""},{"$f":"IF(ISBLANK('3-PAPILLONS'!$F$14),\"\",'3-PAPILLONS'!$F$14)","v":""},{"$f":"IF(ISBLANK('3-PAPILLONS'!$G$14),\"\",'3-PAPILLONS'!$G$14)","v":""},{"$f":"IF(ISBLANK('3-PAPILLONS'!$C$8),\"\",'3-PAPILLONS'!$C$8)","v":""},{"$f":"IF(ISBLANK('3-PAPILLONS'!$F$11),\"\",'3-PAPILLONS'!$F$11)","v":""},{"$f":"VLOOKUP('compilation données pour export'!$R82,'listes valeurs'!$X$2:$AA$3450,2,FALSE)","v":"Myrtil"},{"$f":"'3-PAPILLONS'!$A$19","v":"MYR"},{"$f":"VLOOKUP('compilation données pour export'!$R82,'listes valeurs'!$X$2:$AA$3450,4,FALSE)","v":"Maniola jurtina"},{"$f":"VLOOKUP('compilation données pour export'!$R82,'listes valeurs'!$X$2:$AA$3450,3,FALSE)","v":"Papillons"},"Nombre individus",{"$f":"IF(ISBLANK('3-PAPILLONS'!F$19),\"\",'3-PAPILLONS'!F$19)","v":""},"in",{"$f":"'Synthese Annuelle Monitoring'!$Q$30","v":0}]
[{"$f":"'0-INFOS GENERALES A REMPLIR'!$B$4","v":2021},{"$f":"'0-INFOS GENERALES A REMPLIR'!$B$6","v":0},{"$f":"IF(ISBLANK('0-INFOS GENERALES A REMPLIR'!$E$12),\"\",'0-INFOS GENERALES A REMPLIR'!$E$12)","v":""},{"$f":"IF(ISBLANK('0-INFOS GENERALES A REMPLIR'!$A$12),\"\",'0-INFOS GENERALES A REMPLIR'!$A$12)","v":""},{"$f":"IF(ISBLANK('0-INFOS GENERALES A REMPLIR'!$D$12),\"\",'0-INFOS GENERALES A REMPLIR'!$D$12)","v":""},{"$f":"IFERROR(INDEX('listes valeurs'!F$2:F$552,MATCH(1,('listes valeurs'!B$2:B$552=B83)*('listes valeurs'!E$2:E$552=D83),0)),\"\")","v":""},null,null,null,null,{"$f":"'3-PAPILLONS'!$F$10","v":"Passage 2"},{"$f":"IF(ISBLANK('3-PAPILLONS'!$F$12),\"\",'3-PAPILLONS'!$F$12)","v":""},{"$f":"IF(ISBLANK('3-PAPILLONS'!$F$14),\"\",'3-PAPILLONS'!$F$14)","v":""},{"$f":"IF(ISBLANK('3-PAPILLONS'!$G$14),\"\",'3-PAPILLONS'!$G$14)","v":""},{"$f":"IF(ISBLANK('3-PAPILLONS'!$C$8),\"\",'3-PAPILLONS'!$C$8)","v":""},{"$f":"IF(ISBLANK('3-PAPILLONS'!$F$11),\"\",'3-PAPILLONS'!$F$11)","v":""},{"$f":"VLOOKUP('compilation données pour export'!$R83,'listes valeurs'!$X$2:$AA$3450,2,FALSE)","v":"Myrtil"},{"$f":"'3-PAPILLONS'!$A$19","v":"MYR"},{"$f":"VLOOKUP('compilation données pour export'!$R83,'listes valeurs'!$X$2:$AA$3450,4,FALSE)","v":"Maniola jurtina"},{"$f":"VLOOKUP('compilation données pour export'!$R83,'listes valeurs'!$X$2:$AA$3450,3,FALSE)","v":"Papillons"},"Nombre individus",{"$f":"IF(ISBLANK('3-PAPILLONS'!G$19),\"\",'3-PAPILLONS'!G$19)","v":""},"out",{"$f":"'Synthese Annuelle Monitoring'!$Q$30","v":0}]
[{"$f":"'0-INFOS GENERALES A REMPLIR'!$B$4","v":2021},{"$f":"'0-INFOS GENERALES A REMPLIR'!$B$6","v":0},{"$f":"IF(ISBLANK('0-INFOS GENERALES A REMPLIR'!$E$13),\"\",'0-INFOS GENERALES A REMPLIR'!$E$13)","v":""},{"$f":"IF(ISBLANK('0-INFOS GENERALES A REMPLIR'!$A$13),\"\",'0-INFOS GENERALES A REMPLIR'!$A$13)","v":""},{"$f":"IF(ISBLANK('0-INFOS GENERALES A REMPLIR'!$D$13),\"\",'0-INFOS GENERALES A REMPLIR'!$D$13)","v":""},{"$f":"IFERROR(INDEX('listes valeurs'!F$2:F$552,MATCH(1,('listes valeurs'!B$2:B$552=B84)*('listes valeurs'!E$2:E$552=D84),0)),\"\")","v":""},null,null,null,null,{"$f":"'3-PAPILLONS'!$C$46","v":"Passage 1"},{"$f":"IF(ISBLANK('3-PAPILLONS'!$C$48),\"\",'3-PAPILLONS'!$C$48)","v":""},{"$f":"IF(ISBLANK('3-PAPILLONS'!$C$50),\"\",'3-PAPILLONS'!$C$50)","v":""},{"$f":"IF(ISBLANK('3-PAPILLONS'!$D$50),\"\",'3-PAPILLONS'!$D$50)","v":""},{"$f":"IF(ISBLANK('3-PAPILLONS'!$C$44),\"\",'3-PAPILLONS'!$C$44)","v":""},{"$f":"IF(ISBLANK('3-PAPILLONS'!$C$47),\"\",'3-PAPILLONS'!$C$47)","v":""},{"$f":"VLOOKUP('compilation données pour export'!$R84,'listes valeurs'!$X$2:$AA$3450,2,FALSE)","v":"Myrtil"},{"$f":"'3-PAPILLONS'!$A$19","v":"MYR"},{"$f":"VLOOKUP('compilation données pour export'!$R84,'listes valeurs'!$X$2:$AA$3450,4,FALSE)","v":"Maniola jurtina"},{"$f":"VLOOKUP('compilation données pour export'!$R84,'listes valeurs'!$X$2:$AA$3450,3,FALSE)","v":"Papillons"},"Nombre individus",{"$f":"IF(ISBLANK('3-PAPILLONS'!C$55),\"\",'3-PAPILLONS'!C$55)","v":""},"in",{"$f":"'Synthese Annuelle Monitoring'!$Q$30","v":0}]
[{"$f":"'0-INFOS GENERALES A REMPLIR'!$B$4","v":2021},{"$f":"'0-INFOS GENERALES A REMPLIR'!$B$6","v":0},{"$f":"IF(ISBLANK('0-INFOS GENERALES A REMPLIR'!$E$13),\"\",'0-INFOS GENERALES A REMPLIR'!$E$13)","v":""},{"$f":"IF(ISBLANK('0-INFOS GENERALES A REMPLIR'!$A$13),\"\",'0-INFOS GENERALES A REMPLIR'!$A$13)","v":""},{"$f":"IF(ISBLANK('0-INFOS GENERALES A REMPLIR'!$D$13),\"\",'0-INFOS GENERALES A REMPLIR'!$D$13)","v":""},{"$f":"IFERROR(INDEX('listes valeurs'!F$2:F$552,MATCH(1,('listes valeurs'!B$2:B$552=B85)*('listes valeurs'!E$2:E$552=D85),0)),\"\")","v":""},null,null,null,null,{"$f":"'3-PAPILLONS'!$C$46","v":"Passage 1"},{"$f":"IF(ISBLANK('3-PAPILLONS'!$C$48),\"\",'3-PAPILLONS'!$C$48)","v":""},{"$f":"IF(ISBLANK('3-PAPILLONS'!$C$50),\"\",'3-PAPILLONS'!$C$50)","v":""},{"$f":"IF(ISBLANK('3-PAPILLONS'!$D$50),\"\",'3-PAPILLONS'!$D$50)","v":""},{"$f":"IF(ISBLANK('3-PAPILLONS'!$C$44),\"\",'3-PAPILLONS'!$C$44)","v":""},{"$f":"IF(ISBLANK('3-PAPILLONS'!$C$47),\"\",'3-PAPILLONS'!$C$47)","v":""},{"$f":"VLOOKUP('compilation données pour export'!$R85,'listes valeurs'!$X$2:$AA$3450,2,FALSE)","v":"Myrtil"},{"$f":"'3-PAPILLONS'!$A$19","v":"MYR"},{"$f":"VLOOKUP('compilation données pour export'!$R85,'listes valeurs'!$X$2:$AA$3450,4,FALSE)","v":"Maniola jurtina"},{"$f":"VLOOKUP('compilation données pour export'!$R85,'listes valeurs'!$X$2:$AA$3450,3,FALSE)","v":"Papillons"},"Nombre individus",{"$f":"IF(ISBLANK('3-PAPILLONS'!D$55),\"\",'3-PAPILLONS'!D$55)","v":""},"out",{"$f":"'Synthese Annuelle Monitoring'!$Q$30","v":0}]
[{"$f":"'0-INFOS GENERALES A REMPLIR'!$B$4","v":2021},{"$f":"'0-INFOS GENERALES A REMPLIR'!$B$6","v":0},{"$f":"IF(ISBLANK('0-INFOS GENERALES A REMPLIR'!$E$13),\"\",'0-INFOS GENERALES A REMPLIR'!$E$13)","v":""},{"$f":"IF(ISBLANK('0-INFOS GENERALES A REMPLIR'!$A$13),\"\",'0-INFOS GENERALES A REMPLIR'!$A$13)","v":""},{"$f":"IF(ISBLANK('0-INFOS GENERALES A REMPLIR'!$D$13),\"\",'0-INFOS GENERALES A REMPLIR'!$D$13)","v":""},{"$f":"IFERROR(INDEX('listes valeurs'!F$2:F$552,MATCH(1,('listes valeurs'!B$2:B$552=B86)*('listes valeurs'!E$2:E$552=D86),0)),\"\")","v":""},null,null,null,null,{"$f":"'3-PAPILLONS'!$F$46","v":"Passage 2"},{"$f":"IF(ISBLANK('3-PAPILLONS'!$F$48),\"\",'3-PAPILLONS'!$F$48)","v":""},{"$f":"IF(ISBLANK('3-PAPILLONS'!$F$50),\"\",'3-PAPILLONS'!$F$50)","v":""},{"$f":"IF(ISBLANK('3-PAPILLONS'!$G$50),\"\",'3-PAPILLONS'!$G$50)","v":""},{"$f":"IF(ISBLANK('3-PAPILLONS'!$C$44),\"\",'3-PAPILLONS'!$C$44)","v":""},{"$f":"IF(ISBLANK('3-PAPILLONS'!$F$47),\"\",'3-PAPILLONS'!$F$47)","v":""},{"$f":"VLOOKUP('compilation données pour export'!$R86,'listes valeurs'!$X$2:$AA$3450,2,FALSE)","v":"Myrtil"},{"$f":"'3-PAPILLONS'!$A$19","v":"MYR"},{"$f":"VLOOKUP('compilation données pour export'!$R86,'listes valeurs'!$X$2:$AA$3450,4,FALSE)","v":"Maniola jurtina"},{"$f":"VLOOKUP('compilation données pour export'!$R86,'listes valeurs'!$X$2:$AA$3450,3,FALSE)","v":"Papillons"},"Nombre individus",{"$f":"IF(ISBLANK('3-PAPILLONS'!F$55),\"\",'3-PAPILLONS'!F$55)","v":""},"in",{"$f":"'Synthese Annuelle Monitoring'!$Q$30","v":0}]
[{"$f":"'0-INFOS GENERALES A REMPLIR'!$B$4","v":2021},{"$f":"'0-INFOS GENERALES A REMPLIR'!$B$6","v":0},{"$f":"IF(ISBLANK('0-INFOS GENERALES A REMPLIR'!$E$13),\"\",'0-INFOS GENERALES A REMPLIR'!$E$13)","v":""},{"$f":"IF(ISBLANK('0-INFOS GENERALES A REMPLIR'!$A$13),\"\",'0-INFOS GENERALES A REMPLIR'!$A$13)","v":""},{"$f":"IF(ISBLANK('0-INFOS GENERALES A REMPLIR'!$D$13),\"\",'0-INFOS GENERALES A REMPLIR'!$D$13)","v":""},{"$f":"IFERROR(INDEX('listes valeurs'!F$2:F$552,MATCH(1,('listes valeurs'!B$2:B$552=B87)*('listes valeurs'!E$2:E$552=D87),0)),\"\")","v":""},null,null,null,null,{"$f":"'3-PAPILLONS'!$F$46","v":"Passage 2"},{"$f":"IF(ISBLANK('3-PAPILLONS'!$F$48),\"\",'3-PAPILLONS'!$F$48)","v":""},{"$f":"IF(ISBLANK('3-PAPILLONS'!$F$50),\"\",'3-PAPILLONS'!$F$50)","v":""},{"$f":"IF(ISBLANK('3-PAPILLONS'!$G$50),\"\",'3-PAPILLONS'!$G$50)","v":""},{"$f":"IF(ISBLANK('3-PAPILLONS'!$C$44),\"\",'3-PAPILLONS'!$C$44)","v":""},{"$f":"IF(ISBLANK('3-PAPILLONS'!$F$47),\"\",'3-PAPILLONS'!$F$47)","v":""},{"$f":"VLOOKUP('compilation données pour export'!$R87,'listes valeurs'!$X$2:$AA$3450,2,FALSE)","v":"Myrtil"},{"$f":"'3-PAPILLONS'!$A$19","v":"MYR"},{"$f":"VLOOKUP('compilation données pour export'!$R87,'listes valeurs'!$X$2:$AA$3450,4,FALSE)","v":"Maniola jurtina"},{"$f":"VLOOKUP('compilation données pour export'!$R87,'listes valeurs'!$X$2:$AA$3450,3,FALSE)","v":"Papillons"},"Nombre individus",{"$f":"IF(ISBLANK('3-PAPILLONS'!G$55),\"\",'3-PAPILLONS'!G$55)","v":""},"out",{"$f":"'Synthese Annuelle Monitoring'!$Q$30","v":0}]
[{"$f":"'0-INFOS GENERALES A REMPLIR'!$B$4","v":2021},{"$f":"'0-INFOS GENERALES A REMPLIR'!$B$6","v":0},{"$f":"IF(ISBLANK('0-INFOS GENERALES A REMPLIR'!$E$14),\"\",'0-INFOS GENERALES A REMPLIR'!$E$14)","v":""},{"$f":"IF(ISBLANK('0-INFOS GENERALES A REMPLIR'!$A$14),\"\",'0-INFOS GENERALES A REMPLIR'!$A$14)","v":""},{"$f":"IF(ISBLANK('0-INFOS GENERALES A REMPLIR'!$D$14),\"\",'0-INFOS GENERALES A REMPLIR'!$D$14)","v":""},{"$f":"IFERROR(INDEX('listes valeurs'!F$2:F$552,MATCH(1,('listes valeurs'!B$2:B$552=B88)*('listes valeurs'!E$2:E$552=D88),0)),\"\")","v":""},null,null,null,null,{"$f":"'3-PAPILLONS'!$C$82","v":"Passage 1"},{"$f":"IF(ISBLANK('3-PAPILLONS'!$C$84),\"\",'3-PAPILLONS'!$C$84)","v":""},{"$f":"IF(ISBLANK('3-PAPILLONS'!$C$86),\"\",'3-PAPILLONS'!$C$86)","v":""},{"$f":"IF(ISBLANK('3-PAPILLONS'!$D$86),\"\",'3-PAPILLONS'!$D$86)","v":""},{"$f":"IF(ISBLANK('3-PAPILLONS'!$C$80),\"\",'3-PAPILLONS'!$C$80)","v":""},{"$f":"IF(ISBLANK('3-PAPILLONS'!$C$83),\"\",'3-PAPILLONS'!$C$83)","v":""},{"$f":"VLOOKUP('compilation données pour export'!$R88,'listes valeurs'!$X$2:$AA$3450,2,FALSE)","v":"Myrtil"},{"$f":"'3-PAPILLONS'!$A$19","v":"MYR"},{"$f":"VLOOKUP('compilation données pour export'!$R88,'listes valeurs'!$X$2:$AA$3450,4,FALSE)","v":"Maniola jurtina"},{"$f":"VLOOKUP('compilation données pour export'!$R88,'listes valeurs'!$X$2:$AA$3450,3,FALSE)","v":"Papillons"},"Nombre individus",{"$f":"IF(ISBLANK('3-PAPILLONS'!C$91),\"\",'3-PAPILLONS'!C$91)","v":""},"in",{"$f":"'Synthese Annuelle Monitoring'!$Q$30","v":0}]
[{"$f":"'0-INFOS GENERALES A REMPLIR'!$B$4","v":2021},{"$f":"'0-INFOS GENERALES A REMPLIR'!$B$6","v":0},{"$f":"IF(ISBLANK('0-INFOS GENERALES A REMPLIR'!$E$14),\"\",'0-INFOS GENERALES A REMPLIR'!$E$14)","v":""},{"$f":"IF(ISBLANK('0-INFOS GENERALES A REMPLIR'!$A$14),\"\",'0-INFOS GENERALES A REMPLIR'!$A$14)","v":""},{"$f":"IF(ISBLANK('0-INFOS GENERALES A REMPLIR'!$D$14),\"\",'0-INFOS GENERALES A REMPLIR'!$D$14)","v":""},{"$f":"IFERROR(INDEX('listes valeurs'!F$2:F$552,MATCH(1,('listes valeurs'!B$2:B$552=B89)*('listes valeurs'!E$2:E$552=D89),0)),\"\")","v":""},null,null,null,null,{"$f":"'3-PAPILLONS'!$C$82","v":"Passage 1"},{"$f":"IF(ISBLANK('3-PAPILLONS'!$C$84),\"\",'3-PAPILLONS'!$C$84)","v":""},{"$f":"IF(ISBLANK('3-PAPILLONS'!$C$86),\"\",'3-PAPILLONS'!$C$86)","v":""},{"$f":"IF(ISBLANK('3-PAPILLONS'!$D$86),\"\",'3-PAPILLONS'!$D$86)","v":""},{"$f":"IF(ISBLANK('3-PAPILLONS'!$C$80),\"\",'3-PAPILLONS'!$C$80)","v":""},{"$f":"IF(ISBLANK('3-PAPILLONS'!$C$83),\"\",'3-PAPILLONS'!$C$83)","v":""},{"$f":"VLOOKUP('compilation données pour export'!$R89,'listes valeurs'!$X$2:$AA$3450,2,FALSE)","v":"Myrtil"},{"$f":"'3-PAPILLONS'!$A$19","v":"MYR"},{"$f":"VLOOKUP('compilation données pour export'!$R89,'listes valeurs'!$X$2:$AA$3450,4,FALSE)","v":"Maniola jurtina"},{"$f":"VLOOKUP('compilation données pour export'!$R89,'listes valeurs'!$X$2:$AA$3450,3,FALSE)","v":"Papillons"},"Nombre individus",{"$f":"IF(ISBLANK('3-PAPILLONS'!D$91),\"\",'3-PAPILLONS'!D$91)","v":""},"out",{"$f":"'Synthese Annuelle Monitoring'!$Q$30","v":0}]
[{"$f":"'0-INFOS GENERALES A REMPLIR'!$B$4","v":2021},{"$f":"'0-INFOS GENERALES A REMPLIR'!$B$6","v":0},{"$f":"IF(ISBLANK('0-INFOS GENERALES A REMPLIR'!$E$14),\"\",'0-INFOS GENERALES A REMPLIR'!$E$14)","v":""},{"$f":"IF(ISBLANK('0-INFOS GENERALES A REMPLIR'!$A$14),\"\",'0-INFOS GENERALES A REMPLIR'!$A$14)","v":""},{"$f":"IF(ISBLANK('0-INFOS GENERALES A REMPLIR'!$D$14),\"\",'0-INFOS GENERALES A REMPLIR'!$D$14)","v":""},{"$f":"IFERROR(INDEX('listes valeurs'!F$2:F$552,MATCH(1,('listes valeurs'!B$2:B$552=B90)*('listes valeurs'!E$2:E$552=D90),0)),\"\")","v":""},null,null,null,null,{"$f":"'3-PAPILLONS'!$F$82","v":"Passage 2"},{"$f":"IF(ISBLANK('3-PAPILLONS'!$F$84),\"\",'3-PAPILLONS'!$F$84)","v":""},{"$f":"IF(ISBLANK('3-PAPILLONS'!$F$86),\"\",'3-PAPILLONS'!$F$86)","v":""},{"$f":"IF(ISBLANK('3-PAPILLONS'!$G$86),\"\",'3-PAPILLONS'!$G$86)","v":""},{"$f":"IF(ISBLANK('3-PAPILLONS'!$C$80),\"\",'3-PAPILLONS'!$C$80)","v":""},{"$f":"IF(ISBLANK('3-PAPILLONS'!$F$83),\"\",'3-PAPILLONS'!$F$83)","v":""},{"$f":"VLOOKUP('compilation données pour export'!$R90,'listes valeurs'!$X$2:$AA$3450,2,FALSE)","v":"Myrtil"},{"$f":"'3-PAPILLONS'!$A$19","v":"MYR"},{"$f":"VLOOKUP('compilation données pour export'!$R90,'listes valeurs'!$X$2:$AA$3450,4,FALSE)","v":"Maniola jurtina"},{"$f":"VLOOKUP('compilation données pour export'!$R90,'listes valeurs'!$X$2:$AA$3450,3,FALSE)","v":"Papillons"},"Nombre individus",{"$f":"IF(ISBLANK('3-PAPILLONS'!F$91),\"\",'3-PAPILLONS'!F$91)","v":""},"in",{"$f":"'Synthese Annuelle Monitoring'!$Q$30","v":0}]
[{"$f":"'0-INFOS GENERALES A REMPLIR'!$B$4","v":2021},{"$f":"'0-INFOS GENERALES A REMPLIR'!$B$6","v":0},{"$f":"IF(ISBLANK('0-INFOS GENERALES A REMPLIR'!$E$14),\"\",'0-INFOS GENERALES A REMPLIR'!$E$14)","v":""},{"$f":"IF(ISBLANK('0-INFOS GENERALES A REMPLIR'!$A$14),\"\",'0-INFOS GENERALES A REMPLIR'!$A$14)","v":""},{"$f":"IF(ISBLANK('0-INFOS GENERALES A REMPLIR'!$D$14),\"\",'0-INFOS GENERALES A REMPLIR'!$D$14)","v":""},{"$f":"IFERROR(INDEX('listes valeurs'!F$2:F$552,MATCH(1,('listes valeurs'!B$2:B$552=B91)*('listes valeurs'!E$2:E$552=D91),0)),\"\")","v":""},null,null,null,null,{"$f":"'3-PAPILLONS'!$F$82","v":"Passage 2"},{"$f":"IF(ISBLANK('3-PAPILLONS'!$F$84),\"\",'3-PAPILLONS'!$F$84)","v":""},{"$f":"IF(ISBLANK('3-PAPILLONS'!$F$86),\"\",'3-PAPILLONS'!$F$86)","v":""},{"$f":"IF(ISBLANK('3-PAPILLONS'!$G$86),\"\",'3-PAPILLONS'!$G$86)","v":""},{"$f":"IF(ISBLANK('3-PAPILLONS'!$C$80),\"\",'3-PAPILLONS'!$C$80)","v":""},{"$f":"IF(ISBLANK('3-PAPILLONS'!$F$83),\"\",'3-PAPILLONS'!$F$83)","v":""},{"$f":"VLOOKUP('compilation données pour export'!$R91,'listes valeurs'!$X$2:$AA$3450,2,FALSE)","v":"Myrtil"},{"$f":"'3-PAPILLONS'!$A$19","v":"MYR"},{"$f":"VLOOKUP('compilation données pour export'!$R91,'listes valeurs'!$X$2:$AA$3450,4,FALSE)","v":"Maniola jurtina"},{"$f":"VLOOKUP('compilation données pour export'!$R91,'listes valeurs'!$X$2:$AA$3450,3,FALSE)","v":"Papillons"},"Nombre individus",{"$f":"IF(ISBLANK('3-PAPILLONS'!G$91),\"\",'3-PAPILLONS'!G$91)","v":""},"out",{"$f":"'Synthese Annuelle Monitoring'!$Q$30","v":0}]
[{"$f":"'0-INFOS GENERALES A REMPLIR'!$B$4","v":2021},{"$f":"'0-INFOS GENERALES A REMPLIR'!$B$6","v":0},{"$f":"IF(ISBLANK('0-INFOS GENERALES A REMPLIR'!$E$15),\"\",'0-INFOS GENERALES A REMPLIR'!$E$15)","v":""},{"$f":"IF(ISBLANK('0-INFOS GENERALES A REMPLIR'!$A$15),\"\",'0-INFOS GENERALES A REMPLIR'!$A$15)","v":""},{"$f":"IF(ISBLANK('0-INFOS GENERALES A REMPLIR'!$D$15),\"\",'0-INFOS GENERALES A REMPLIR'!$D$15)","v":""},{"$f":"IFERROR(INDEX('listes valeurs'!F$2:F$552,MATCH(1,('listes valeurs'!B$2:B$552=B92)*('listes valeurs'!E$2:E$552=D92),0)),\"\")","v":""},null,null,null,null,{"$f":"'3-PAPILLONS'!$C$118","v":"Passage 1"},{"$f":"IF(ISBLANK('3-PAPILLONS'!$C$120),\"\",'3-PAPILLONS'!$C$120)","v":""},{"$f":"IF(ISBLANK('3-PAPILLONS'!$C$122),\"\",'3-PAPILLONS'!$C$122)","v":""},{"$f":"IF(ISBLANK('3-PAPILLONS'!$D$122),\"\",'3-PAPILLONS'!$D$122)","v":""},{"$f":"IF(ISBLANK('3-PAPILLONS'!$C$116),\"\",'3-PAPILLONS'!$C$116)","v":""},{"$f":"IF(ISBLANK('3-PAPILLONS'!$C$119),\"\",'3-PAPILLONS'!$C$119)","v":""},{"$f":"VLOOKUP('compilation données pour export'!$R92,'listes valeurs'!$X$2:$AA$3450,2,FALSE)","v":"Myrtil"},{"$f":"'3-PAPILLONS'!$A$19","v":"MYR"},{"$f":"VLOOKUP('compilation données pour export'!$R92,'listes valeurs'!$X$2:$AA$3450,4,FALSE)","v":"Maniola jurtina"},{"$f":"VLOOKUP('compilation données pour export'!$R92,'listes valeurs'!$X$2:$AA$3450,3,FALSE)","v":"Papillons"},"Nombre individus",{"$f":"IF(ISBLANK('3-PAPILLONS'!C$127),\"\",'3-PAPILLONS'!C$127)","v":""},"in",{"$f":"'Synthese Annuelle Monitoring'!$Q$30","v":0}]
[{"$f":"'0-INFOS GENERALES A REMPLIR'!$B$4","v":2021},{"$f":"'0-INFOS GENERALES A REMPLIR'!$B$6","v":0},{"$f":"IF(ISBLANK('0-INFOS GENERALES A REMPLIR'!$E$15),\"\",'0-INFOS GENERALES A REMPLIR'!$E$15)","v":""},{"$f":"IF(ISBLANK('0-INFOS GENERALES A REMPLIR'!$A$15),\"\",'0-INFOS GENERALES A REMPLIR'!$A$15)","v":""},{"$f":"IF(ISBLANK('0-INFOS GENERALES A REMPLIR'!$D$15),\"\",'0-INFOS GENERALES A REMPLIR'!$D$15)","v":""},{"$f":"IFERROR(INDEX('listes valeurs'!F$2:F$552,MATCH(1,('listes valeurs'!B$2:B$552=B93)*('listes valeurs'!E$2:E$552=D93),0)),\"\")","v":""},null,null,null,null,{"$f":"'3-PAPILLONS'!$C$118","v":"Passage 1"},{"$f":"IF(ISBLANK('3-PAPILLONS'!$C$120),\"\",'3-PAPILLONS'!$C$120)","v":""},{"$f":"IF(ISBLANK('3-PAPILLONS'!$C$122),\"\",'3-PAPILLONS'!$C$122)","v":""},{"$f":"IF(ISBLANK('3-PAPILLONS'!$D$122),\"\",'3-PAPILLONS'!$D$122)","v":""},{"$f":"IF(ISBLANK('3-PAPILLONS'!$C$116),\"\",'3-PAPILLONS'!$C$116)","v":""},{"$f":"IF(ISBLANK('3-PAPILLONS'!$C$119),\"\",'3-PAPILLONS'!$C$119)","v":""},{"$f":"VLOOKUP('compilation données pour export'!$R93,'listes valeurs'!$X$2:$AA$3450,2,FALSE)","v":"Myrtil"},{"$f":"'3-PAPILLONS'!$A$19","v":"MYR"},{"$f":"VLOOKUP('compilation données pour export'!$R93,'listes valeurs'!$X$2:$AA$3450,4,FALSE)","v":"Maniola jurtina"},{"$f":"VLOOKUP('compilation données pour export'!$R93,'listes valeurs'!$X$2:$AA$3450,3,FALSE)","v":"Papillons"},"Nombre individus",{"$f":"IF(ISBLANK('3-PAPILLONS'!D$127),\"\",'3-PAPILLONS'!D$127)","v":""},"out",{"$f":"'Synthese Annuelle Monitoring'!$Q$30","v":0}]
[{"$f":"'0-INFOS GENERALES A REMPLIR'!$B$4","v":2021},{"$f":"'0-INFOS GENERALES A REMPLIR'!$B$6","v":0},{"$f":"IF(ISBLANK('0-INFOS GENERALES A REMPLIR'!$E$15),\"\",'0-INFOS GENERALES A REMPLIR'!$E$15)","v":""},{"$f":"IF(ISBLANK('0-INFOS GENERALES A REMPLIR'!$A$15),\"\",'0-INFOS GENERALES A REMPLIR'!$A$15)","v":""},{"$f":"IF(ISBLANK('0-INFOS GENERALES A REMPLIR'!$D$15),\"\",'0-INFOS GENERALES A REMPLIR'!$D$15)","v":""},{"$f":"IFERROR(INDEX('listes valeurs'!F$2:F$552,MATCH(1,('listes valeurs'!B$2:B$552=B94)*('listes valeurs'!E$2:E$552=D94),0)),\"\")","v":""},null,null,null,null,{"$f":"'3-PAPILLONS'!$F$118","v":"Passage 2"},{"$f":"IF(ISBLANK('3-PAPILLONS'!$F$120),\"\",'3-PAPILLONS'!$F$120)","v":""},{"$f":"IF(ISBLANK('3-PAPILLONS'!$F$122),\"\",'3-PAPILLONS'!$F$122)","v":""},{"$f":"IF(ISBLANK('3-PAPILLONS'!$G$122),\"\",'3-PAPILLONS'!$G$122)","v":""},{"$f":"IF(ISBLANK('3-PAPILLONS'!$C$116),\"\",'3-PAPILLONS'!$C$116)","v":""},{"$f":"IF(ISBLANK('3-PAPILLONS'!$F$119),\"\",'3-PAPILLONS'!$F$119)","v":""},{"$f":"VLOOKUP('compilation données pour export'!$R94,'listes valeurs'!$X$2:$AA$3450,2,FALSE)","v":"Myrtil"},{"$f":"'3-PAPILLONS'!$A$19","v":"MYR"},{"$f":"VLOOKUP('compilation données pour export'!$R94,'listes valeurs'!$X$2:$AA$3450,4,FALSE)","v":"Maniola jurtina"},{"$f":"VLOOKUP('compilation données pour export'!$R94,'listes valeurs'!$X$2:$AA$3450,3,FALSE)","v":"Papillons"},"Nombre individus",{"$f":"IF(ISBLANK('3-PAPILLONS'!F$127),\"\",'3-PAPILLONS'!F$127)","v":""},"in",{"$f":"'Synthese Annuelle Monitoring'!$Q$30","v":0}]
[{"$f":"'0-INFOS GENERALES A REMPLIR'!$B$4","v":2021},{"$f":"'0-INFOS GENERALES A REMPLIR'!$B$6","v":0},{"$f":"IF(ISBLANK('0-INFOS GENERALES A REMPLIR'!$E$15),\"\",'0-INFOS GENERALES A REMPLIR'!$E$15)","v":""},{"$f":"IF(ISBLANK('0-INFOS GENERALES A REMPLIR'!$A$15),\"\",'0-INFOS GENERALES A REMPLIR'!$A$15)","v":""},{"$f":"IF(ISBLANK('0-INFOS GENERALES A REMPLIR'!$D$15),\"\",'0-INFOS GENERALES A REMPLIR'!$D$15)","v":""},{"$f":"IFERROR(INDEX('listes valeurs'!F$2:F$552,MATCH(1,('listes valeurs'!B$2:B$552=B95)*('listes valeurs'!E$2:E$552=D95),0)),\"\")","v":""},null,null,null,null,{"$f":"'3-PAPILLONS'!$F$118","v":"Passage 2"},{"$f":"IF(ISBLANK('3-PAPILLONS'!$F$120),\"\",'3-PAPILLONS'!$F$120)","v":""},{"$f":"IF(ISBLANK('3-PAPILLONS'!$F$122),\"\",'3-PAPILLONS'!$F$122)","v":""},{"$f":"IF(ISBLANK('3-PAPILLONS'!$G$122),\"\",'3-PAPILLONS'!$G$122)","v":""},{"$f":"IF(ISBLANK('3-PAPILLONS'!$C$116),\"\",'3-PAPILLONS'!$C$116)","v":""},{"$f":"IF(ISBLANK('3-PAPILLONS'!$F$119),\"\",'3-PAPILLONS'!$F$119)","v":""},{"$f":"VLOOKUP('compilation données pour export'!$R95,'listes valeurs'!$X$2:$AA$3450,2,FALSE)","v":"Myrtil"},{"$f":"'3-PAPILLONS'!$A$19","v":"MYR"},{"$f":"VLOOKUP('compilation données pour export'!$R95,'listes valeurs'!$X$2:$AA$3450,4,FALSE)","v":"Maniola jurtina"},{"$f":"VLOOKUP('compilation données pour export'!$R95,'listes valeurs'!$X$2:$AA$3450,3,FALSE)","v":"Papillons"},"Nombre individus",{"$f":"IF(ISBLANK('3-PAPILLONS'!G$127),\"\",'3-PAPILLONS'!G$127)","v":""},"out",{"$f":"'Synthese Annuelle Monitoring'!$Q$30","v":0}]
[{"$f":"'0-INFOS GENERALES A REMPLIR'!$B$4","v":2021},{"$f":"'0-INFOS GENERALES A REMPLIR'!$B$6","v":0},{"$f":"IF(ISBLANK('0-INFOS GENERALES A REMPLIR'!$E$16),\"\",'0-INFOS GENERALES A REMPLIR'!$E$16)","v":""},{"$f":"IF(ISBLANK('0-INFOS GENERALES A REMPLIR'!$A$16),\"\",'0-INFOS GENERALES A REMPLIR'!$A$16)","v":""},{"$f":"IF(ISBLANK('0-INFOS GENERALES A REMPLIR'!$D$16),\"\",'0-INFOS GENERALES A REMPLIR'!$D$16)","v":""},{"$f":"IFERROR(INDEX('listes valeurs'!F$2:F$552,MATCH(1,('listes valeurs'!B$2:B$552=B96)*('listes valeurs'!E$2:E$552=D96),0)),\"\")","v":""},null,null,null,null,{"$f":"'3-PAPILLONS'!$C$154","v":"Passage 1"},{"$f":"IF(ISBLANK('3-PAPILLONS'!$C$156),\"\",'3-PAPILLONS'!$C$156)","v":""},{"$f":"IF(ISBLANK('3-PAPILLONS'!$C$158),\"\",'3-PAPILLONS'!$C$158)","v":""},{"$f":"IF(ISBLANK('3-PAPILLONS'!$D$158),\"\",'3-PAPILLONS'!$D$158)","v":""},{"$f":"IF(ISBLANK('3-PAPILLONS'!$C$152),\"\",'3-PAPILLONS'!$C$152)","v":""},{"$f":"IF(ISBLANK('3-PAPILLONS'!$C$155),\"\",'3-PAPILLONS'!$C$155)","v":""},{"$f":"VLOOKUP('compilation données pour export'!$R96,'listes valeurs'!$X$2:$AA$3450,2,FALSE)","v":"Myrtil"},{"$f":"'3-PAPILLONS'!$A$19","v":"MYR"},{"$f":"VLOOKUP('compilation données pour export'!$R96,'listes valeurs'!$X$2:$AA$3450,4,FALSE)","v":"Maniola jurtina"},{"$f":"VLOOKUP('compilation données pour export'!$R96,'listes valeurs'!$X$2:$AA$3450,3,FALSE)","v":"Papillons"},"Nombre individus",{"$f":"IF(ISBLANK('3-PAPILLONS'!C$163),\"\",'3-PAPILLONS'!C$163)","v":""},"in",{"$f":"'Synthese Annuelle Monitoring'!$Q$30","v":0}]
[{"$f":"'0-INFOS GENERALES A REMPLIR'!$B$4","v":2021},{"$f":"'0-INFOS GENERALES A REMPLIR'!$B$6","v":0},{"$f":"IF(ISBLANK('0-INFOS GENERALES A REMPLIR'!$E$16),\"\",'0-INFOS GENERALES A REMPLIR'!$E$16)","v":""},{"$f":"IF(ISBLANK('0-INFOS GENERALES A REMPLIR'!$A$16),\"\",'0-INFOS GENERALES A REMPLIR'!$A$16)","v":""},{"$f":"IF(ISBLANK('0-INFOS GENERALES A REMPLIR'!$D$16),\"\",'0-INFOS GENERALES A REMPLIR'!$D$16)","v":""},{"$f":"IFERROR(INDEX('listes valeurs'!F$2:F$552,MATCH(1,('listes valeurs'!B$2:B$552=B97)*('listes valeurs'!E$2:E$552=D97),0)),\"\")","v":""},null,null,null,null,{"$f":"'3-PAPILLONS'!$C$154","v":"Passage 1"},{"$f":"IF(ISBLANK('3-PAPILLONS'!$C$156),\"\",'3-PAPILLONS'!$C$156)","v":""},{"$f":"IF(ISBLANK('3-PAPILLONS'!$C$158),\"\",'3-PAPILLONS'!$C$158)","v":""},{"$f":"IF(ISBLANK('3-PAPILLONS'!$D$158),\"\",'3-PAPILLONS'!$D$158)","v":""},{"$f":"IF(ISBLANK('3-PAPILLONS'!$C$152),\"\",'3-PAPILLONS'!$C$152)","v":""},{"$f":"IF(ISBLANK('3-PAPILLONS'!$C$155),\"\",'3-PAPILLONS'!$C$155)","v":""},{"$f":"VLOOKUP('compilation données pour export'!$R97,'listes valeurs'!$X$2:$AA$3450,2,FALSE)","v":"Myrtil"},{"$f":"'3-PAPILLONS'!$A$19","v":"MYR"},{"$f":"VLOOKUP('compilation données pour export'!$R97,'listes valeurs'!$X$2:$AA$3450,4,FALSE)","v":"Maniola jurtina"},{"$f":"VLOOKUP('compilation données pour export'!$R97,'listes valeurs'!$X$2:$AA$3450,3,FALSE)","v":"Papillons"},"Nombre individus",{"$f":"IF(ISBLANK('3-PAPILLONS'!D$163),\"\",'3-PAPILLONS'!D$163)","v":""},"out",{"$f":"'Synthese Annuelle Monitoring'!$Q$30","v":0}]
[{"$f":"'0-INFOS GENERALES A REMPLIR'!$B$4","v":2021},{"$f":"'0-INFOS GENERALES A REMPLIR'!$B$6","v":0},{"$f":"IF(ISBLANK('0-INFOS GENERALES A REMPLIR'!$E$16),\"\",'0-INFOS GENERALES A REMPLIR'!$E$16)","v":""},{"$f":"IF(ISBLANK('0-INFOS GENERALES A REMPLIR'!$A$16),\"\",'0-INFOS GENERALES A REMPLIR'!$A$16)","v":""},{"$f":"IF(ISBLANK('0-INFOS GENERALES A REMPLIR'!$D$16),\"\",'0-INFOS GENERALES A REMPLIR'!$D$16)","v":""},{"$f":"IFERROR(INDEX('listes valeurs'!F$2:F$552,MATCH(1,('listes valeurs'!B$2:B$552=B98)*('listes valeurs'!E$2:E$552=D98),0)),\"\")","v":""},null,null,null,null,{"$f":"'3-PAPILLONS'!$F$154","v":"Passage 2"},{"$f":"IF(ISBLANK('3-PAPILLONS'!$F$156),\"\",'3-PAPILLONS'!$F$156)","v":""},{"$f":"IF(ISBLANK('3-PAPILLONS'!$F$158),\"\",'3-PAPILLONS'!$F$158)","v":""},{"$f":"IF(ISBLANK('3-PAPILLONS'!$G$158),\"\",'3-PAPILLONS'!$G$158)","v":""},{"$f":"IF(ISBLANK('3-PAPILLONS'!$C$152),\"\",'3-PAPILLONS'!$C$152)","v":""},{"$f":"IF(ISBLANK('3-PAPILLONS'!$F$155),\"\",'3-PAPILLONS'!$F$155)","v":""},{"$f":"VLOOKUP('compilation données pour export'!$R98,'listes valeurs'!$X$2:$AA$3450,2,FALSE)","v":"Myrtil"},{"$f":"'3-PAPILLONS'!$A$19","v":"MYR"},{"$f":"VLOOKUP('compilation données pour export'!$R98,'listes valeurs'!$X$2:$AA$3450,4,FALSE)","v":"Maniola jurtina"},{"$f":"VLOOKUP('compilation données pour export'!$R98,'listes valeurs'!$X$2:$AA$3450,3,FALSE)","v":"Papillons"},"Nombre individus",{"$f":"IF(ISBLANK('3-PAPILLONS'!F$163),\"\",'3-PAPILLONS'!F$163)","v":""},"in",{"$f":"'Synthese Annuelle Monitoring'!$Q$30","v":0}]
[{"$f":"'0-INFOS GENERALES A REMPLIR'!$B$4","v":2021},{"$f":"'0-INFOS GENERALES A REMPLIR'!$B$6","v":0},{"$f":"IF(ISBLANK('0-INFOS GENERALES A REMPLIR'!$E$16),\"\",'0-INFOS GENERALES A REMPLIR'!$E$16)","v":""},{"$f":"IF(ISBLANK('0-INFOS GENERALES A REMPLIR'!$A$16),\"\",'0-INFOS GENERALES A REMPLIR'!$A$16)","v":""},{"$f":"IF(ISBLANK('0-INFOS GENERALES A REMPLIR'!$D$16),\"\",'0-INFOS GENERALES A REMPLIR'!$D$16)","v":""},{"$f":"IFERROR(INDEX('listes valeurs'!F$2:F$552,MATCH(1,('listes valeurs'!B$2:B$552=B99)*('listes valeurs'!E$2:E$552=D99),0)),\"\")","v":""},null,null,null,null,{"$f":"'3-PAPILLONS'!$F$154","v":"Passage 2"},{"$f":"IF(ISBLANK('3-PAPILLONS'!$F$156),\"\",'3-PAPILLONS'!$F$156)","v":""},{"$f":"IF(ISBLANK('3-PAPILLONS'!$F$158),\"\",'3-PAPILLONS'!$F$158)","v":""},{"$f":"IF(ISBLANK('3-PAPILLONS'!$G$158),\"\",'3-PAPILLONS'!$G$158)","v":""},{"$f":"IF(ISBLANK('3-PAPILLONS'!$C$152),\"\",'3-PAPILLONS'!$C$152)","v":""},{"$f":"IF(ISBLANK('3-PAPILLONS'!$F$155),\"\",'3-PAPILLONS'!$F$155)","v":""},{"$f":"VLOOKUP('compilation données pour export'!$R99,'listes valeurs'!$X$2:$AA$3450,2,FALSE)","v":"Myrtil"},{"$f":"'3-PAPILLONS'!$A$19","v":"MYR"},{"$f":"VLOOKUP('compilation données pour export'!$R99,'listes valeurs'!$X$2:$AA$3450,4,FALSE)","v":"Maniola jurtina"},{"$f":"VLOOKUP('compilation données pour export'!$R99,'listes valeurs'!$X$2:$AA$3450,3,FALSE)","v":"Papillons"},"Nombre individus",{"$f":"IF(ISBLANK('3-PAPILLONS'!G$163),\"\",'3-PAPILLONS'!G$163)","v":""},"out",{"$f":"'Synthese Annuelle Monitoring'!$Q$30","v":0}]
[{"$f":"'0-INFOS GENERALES A REMPLIR'!$B$4","v":2021},{"$f":"'0-INFOS GENERALES A REMPLIR'!$B$6","v":0},{"$f":"IF(ISBLANK('0-INFOS GENERALES A REMPLIR'!$E$12),\"\",'0-INFOS GENERALES A REMPLIR'!$E$12)","v":""},{"$f":"IF(ISBLANK('0-INFOS GENERALES A REMPLIR'!$A$12),\"\",'0-INFOS GENERALES A REMPLIR'!$A$12)","v":""},{"$f":"IF(ISBLANK('0-INFOS GENERALES A REMPLIR'!$D$12),\"\",'0-INFOS GENERALES A REMPLIR'!$D$12)","v":""},{"$f":"IFERROR(INDEX('listes valeurs'!F$2:F$552,MATCH(1,('listes valeurs'!B$2:B$552=B100)*('listes valeurs'!E$2:E$552=D100),0)),\"\")","v":""},null,null,null,null,{"$f":"'3-PAPILLONS'!$C$10","v":"Passage 1"},{"$f":"IF(ISBLANK('3-PAPILLONS'!$C$12),\"\",'3-PAPILLONS'!$C$12)","v":""},{"$f":"IF(ISBLANK('3-PAPILLONS'!$C$14),\"\",'3-PAPILLONS'!$C$14)","v":""},{"$f":"IF(ISBLANK('3-PAPILLONS'!$D$14),\"\",'3-PAPILLONS'!$D$14)","v":""},{"$f":"IF(ISBLANK('3-PAPILLONS'!$C$8),\"\",'3-PAPILLONS'!$C$8)","v":""},{"$f":"IF(ISBLANK('3-PAPILLONS'!$C$11),\"\",'3-PAPILLONS'!$C$11)","v":""},{"$f":"VLOOKUP('compilation données pour export'!$R100,'listes valeurs'!$X$2:$AA$3450,2,FALSE)","v":"Silène"},{"$f":"'3-PAPILLONS'!$A$20","v":"SIL"},{"$f":"VLOOKUP('compilation données pour export'!$R100,'listes valeurs'!$X$2:$AA$3450,4,FALSE)","v":"Brintesia circe"},{"$f":"VLOOKUP('compilation données pour export'!$R100,'listes valeurs'!$X$2:$AA$3450,3,FALSE)","v":"Papillons"},"Nombre individus",{"$f":"IF(ISBLANK('3-PAPILLONS'!C$20),\"\",'3-PAPILLONS'!C$20)","v":""},"in",{"$f":"'Synthese Annuelle Monitoring'!$Q$31","v":0}]
[{"$f":"'0-INFOS GENERALES A REMPLIR'!$B$4","v":2021},{"$f":"'0-INFOS GENERALES A REMPLIR'!$B$6","v":0},{"$f":"IF(ISBLANK('0-INFOS GENERALES A REMPLIR'!$E$12),\"\",'0-INFOS GENERALES A REMPLIR'!$E$12)","v":""},{"$f":"IF(ISBLANK('0-INFOS GENERALES A REMPLIR'!$A$12),\"\",'0-INFOS GENERALES A REMPLIR'!$A$12)","v":""},{"$f":"IF(ISBLANK('0-INFOS GENERALES A REMPLIR'!$D$12),\"\",'0-INFOS GENERALES A REMPLIR'!$D$12)","v":""},{"$f":"IFERROR(INDEX('listes valeurs'!F$2:F$552,MATCH(1,('listes valeurs'!B$2:B$552=B101)*('listes valeurs'!E$2:E$552=D101),0)),\"\")","v":""},null,null,null,null,{"$f":"'3-PAPILLONS'!$C$10","v":"Passage 1"},{"$f":"IF(ISBLANK('3-PAPILLONS'!$C$12),\"\",'3-PAPILLONS'!$C$12)","v":""},{"$f":"IF(ISBLANK('3-PAPILLONS'!$C$14),\"\",'3-PAPILLONS'!$C$14)","v":""},{"$f":"IF(ISBLANK('3-PAPILLONS'!$D$14),\"\",'3-PAPILLONS'!$D$14)","v":""},{"$f":"IF(ISBLANK('3-PAPILLONS'!$C$8),\"\",'3-PAPILLONS'!$C$8)","v":""},{"$f":"IF(ISBLANK('3-PAPILLONS'!$C$11),\"\",'3-PAPILLONS'!$C$11)","v":""},{"$f":"VLOOKUP('compilation données pour export'!$R101,'listes valeurs'!$X$2:$AA$3450,2,FALSE)","v":"Silène"},{"$f":"'3-PAPILLONS'!$A$20","v":"SIL"},{"$f":"VLOOKUP('compilation données pour export'!$R101,'listes valeurs'!$X$2:$AA$3450,4,FALSE)","v":"Brintesia circe"},{"$f":"VLOOKUP('compilation données pour export'!$R101,'listes valeurs'!$X$2:$AA$3450,3,FALSE)","v":"Papillons"},"Nombre individus",{"$f":"IF(ISBLANK('3-PAPILLONS'!D$20),\"\",'3-PAPILLONS'!D$20)","v":""},"out",{"$f":"'Synthese Annuelle Monitoring'!$Q$31","v":0}]
[{"$f":"'0-INFOS GENERALES A REMPLIR'!$B$4","v":2021},{"$f":"'0-INFOS GENERALES A REMPLIR'!$B$6","v":0},{"$f":"IF(ISBLANK('0-INFOS GENERALES A REMPLIR'!$E$12),\"\",'0-INFOS GENERALES A REMPLIR'!$E$12)","v":""},{"$f":"IF(ISBLANK('0-INFOS GENERALES A REMPLIR'!$A$12),\"\",'0-INFOS GENERALES A REMPLIR'!$A$12)","v":""},{"$f":"IF(ISBLANK('0-INFOS GENERALES A REMPLIR'!$D$12),\"\",'0-INFOS GENERALES A REMPLIR'!$D$12)","v":""},{"$f":"IFERROR(INDEX('listes valeurs'!F$2:F$552,MATCH(1,('listes valeurs'!B$2:B$552=B102)*('listes valeurs'!E$2:E$552=D102),0)),\"\")","v":""},null,null,null,null,{"$f":"'3-PAPILLONS'!$F$10","v":"Passage 2"},{"$f":"IF(ISBLANK('3-PAPILLONS'!$F$12),\"\",'3-PAPILLONS'!$F$12)","v":""},{"$f":"IF(ISBLANK('3-PAPILLONS'!$F$14),\"\",'3-PAPILLONS'!$F$14)","v":""},{"$f":"IF(ISBLANK('3-PAPILLONS'!$G$14),\"\",'3-PAPILLONS'!$G$14)","v":""},{"$f":"IF(ISBLANK('3-PAPILLONS'!$C$8),\"\",'3-PAPILLONS'!$C$8)","v":""},{"$f":"IF(ISBLANK('3-PAPILLONS'!$F$11),\"\",'3-PAPILLONS'!$F$11)","v":""},{"$f":"VLOOKUP('compilation données pour export'!$R102,'listes valeurs'!$X$2:$AA$3450,2,FALSE)","v":"Silène"},{"$f":"'3-PAPILLONS'!$A$20","v":"SIL"},{"$f":"VLOOKUP('compilation données pour export'!$R102,'listes valeurs'!$X$2:$AA$3450,4,FALSE)","v":"Brintesia circe"},{"$f":"VLOOKUP('compilation données pour export'!$R102,'listes valeurs'!$X$2:$AA$3450,3,FALSE)","v":"Papillons"},"Nombre individus",{"$f":"IF(ISBLANK('3-PAPILLONS'!F$20),\"\",'3-PAPILLONS'!F$20)","v":""},"in",{"$f":"'Synthese Annuelle Monitoring'!$Q$31","v":0}]
[{"$f":"'0-INFOS GENERALES A REMPLIR'!$B$4","v":2021},{"$f":"'0-INFOS GENERALES A REMPLIR'!$B$6","v":0},{"$f":"IF(ISBLANK('0-INFOS GENERALES A REMPLIR'!$E$12),\"\",'0-INFOS GENERALES A REMPLIR'!$E$12)","v":""},{"$f":"IF(ISBLANK('0-INFOS GENERALES A REMPLIR'!$A$12),\"\",'0-INFOS GENERALES A REMPLIR'!$A$12)","v":""},{"$f":"IF(ISBLANK('0-INFOS GENERALES A REMPLIR'!$D$12),\"\",'0-INFOS GENERALES A REMPLIR'!$D$12)","v":""},{"$f":"IFERROR(INDEX('listes valeurs'!F$2:F$552,MATCH(1,('listes valeurs'!B$2:B$552=B103)*('listes valeurs'!E$2:E$552=D103),0)),\"\")","v":""},null,null,null,null,{"$f":"'3-PAPILLONS'!$F$10","v":"Passage 2"},{"$f":"IF(ISBLANK('3-PAPILLONS'!$F$12),\"\",'3-PAPILLONS'!$F$12)","v":""},{"$f":"IF(ISBLANK('3-PAPILLONS'!$F$14),\"\",'3-PAPILLONS'!$F$14)","v":""},{"$f":"IF(ISBLANK('3-PAPILLONS'!$G$14),\"\",'3-PAPILLONS'!$G$14)","v":""},{"$f":"IF(ISBLANK('3-PAPILLONS'!$C$8),\"\",'3-PAPILLONS'!$C$8)","v":""},{"$f":"IF(ISBLANK('3-PAPILLONS'!$F$11),\"\",'3-PAPILLONS'!$F$11)","v":""},{"$f":"VLOOKUP('compilation données pour export'!$R103,'listes valeurs'!$X$2:$AA$3450,2,FALSE)","v":"Silène"},{"$f":"'3-PAPILLONS'!$A$20","v":"SIL"},{"$f":"VLOOKUP('compilation données pour export'!$R103,'listes valeurs'!$X$2:$AA$3450,4,FALSE)","v":"Brintesia circe"},{"$f":"VLOOKUP('compilation données pour export'!$R103,'listes valeurs'!$X$2:$AA$3450,3,FALSE)","v":"Papillons"},"Nombre individus",{"$f":"IF(ISBLANK('3-PAPILLONS'!G$20),\"\",'3-PAPILLONS'!G$20)","v":""},"out",{"$f":"'Synthese Annuelle Monitoring'!$Q$31","v":0}]
[{"$f":"'0-INFOS GENERALES A REMPLIR'!$B$4","v":2021},{"$f":"'0-INFOS GENERALES A REMPLIR'!$B$6","v":0},{"$f":"IF(ISBLANK('0-INFOS GENERALES A REMPLIR'!$E$13),\"\",'0-INFOS GENERALES A REMPLIR'!$E$13)","v":""},{"$f":"IF(ISBLANK('0-INFOS GENERALES A REMPLIR'!$A$13),\"\",'0-INFOS GENERALES A REMPLIR'!$A$13)","v":""},{"$f":"IF(ISBLANK('0-INFOS GENERALES A REMPLIR'!$D$13),\"\",'0-INFOS GENERALES A REMPLIR'!$D$13)","v":""},{"$f":"IFERROR(INDEX('listes valeurs'!F$2:F$552,MATCH(1,('listes valeurs'!B$2:B$552=B104)*('listes valeurs'!E$2:E$552=D104),0)),\"\")","v":""},null,null,null,null,{"$f":"'3-PAPILLONS'!$C$46","v":"Passage 1"},{"$f":"IF(ISBLANK('3-PAPILLONS'!$C$48),\"\",'3-PAPILLONS'!$C$48)","v":""},{"$f":"IF(ISBLANK('3-PAPILLONS'!$C$50),\"\",'3-PAPILLONS'!$C$50)","v":""},{"$f":"IF(ISBLANK('3-PAPILLONS'!$D$50),\"\",'3-PAPILLONS'!$D$50)","v":""},{"$f":"IF(ISBLANK('3-PAPILLONS'!$C$44),\"\",'3-PAPILLONS'!$C$44)","v":""},{"$f":"IF(ISBLANK('3-PAPILLONS'!$C$47),\"\",'3-PAPILLONS'!$C$47)","v":""},{"$f":"VLOOKUP('compilation données pour export'!$R104,'listes valeurs'!$X$2:$AA$3450,2,FALSE)","v":"Silène"},{"$f":"'3-PAPILLONS'!$A$20","v":"SIL"},{"$f":"VLOOKUP('compilation données pour export'!$R104,'listes valeurs'!$X$2:$AA$3450,4,FALSE)","v":"Brintesia circe"},{"$f":"VLOOKUP('compilation données pour export'!$R104,'listes valeurs'!$X$2:$AA$3450,3,FALSE)","v":"Papillons"},"Nombre individus",{"$f":"IF(ISBLANK('3-PAPILLONS'!C$56),\"\",'3-PAPILLONS'!C$56)","v":""},"in",{"$f":"'Synthese Annuelle Monitoring'!$Q$31","v":0}]
[{"$f":"'0-INFOS GENERALES A REMPLIR'!$B$4","v":2021},{"$f":"'0-INFOS GENERALES A REMPLIR'!$B$6","v":0},{"$f":"IF(ISBLANK('0-INFOS GENERALES A REMPLIR'!$E$13),\"\",'0-INFOS GENERALES A REMPLIR'!$E$13)","v":""},{"$f":"IF(ISBLANK('0-INFOS GENERALES A REMPLIR'!$A$13),\"\",'0-INFOS GENERALES A REMPLIR'!$A$13)","v":""},{"$f":"IF(ISBLANK('0-INFOS GENERALES A REMPLIR'!$D$13),\"\",'0-INFOS GENERALES A REMPLIR'!$D$13)","v":""},{"$f":"IFERROR(INDEX('listes valeurs'!F$2:F$552,MATCH(1,('listes valeurs'!B$2:B$552=B105)*('listes valeurs'!E$2:E$552=D105),0)),\"\")","v":""},null,null,null,null,{"$f":"'3-PAPILLONS'!$C$46","v":"Passage 1"},{"$f":"IF(ISBLANK('3-PAPILLONS'!$C$48),\"\",'3-PAPILLONS'!$C$48)","v":""},{"$f":"IF(ISBLANK('3-PAPILLONS'!$C$50),\"\",'3-PAPILLONS'!$C$50)","v":""},{"$f":"IF(ISBLANK('3-PAPILLONS'!$D$50),\"\",'3-PAPILLONS'!$D$50)","v":""},{"$f":"IF(ISBLANK('3-PAPILLONS'!$C$44),\"\",'3-PAPILLONS'!$C$44)","v":""},{"$f":"IF(ISBLANK('3-PAPILLONS'!$C$47),\"\",'3-PAPILLONS'!$C$47)","v":""},{"$f":"VLOOKUP('compilation données pour export'!$R105,'listes valeurs'!$X$2:$AA$3450,2,FALSE)","v":"Silène"},{"$f":"'3-PAPILLONS'!$A$20","v":"SIL"},{"$f":"VLOOKUP('compilation données pour export'!$R105,'listes valeurs'!$X$2:$AA$3450,4,FALSE)","v":"Brintesia circe"},{"$f":"VLOOKUP('compilation données pour export'!$R105,'listes valeurs'!$X$2:$AA$3450,3,FALSE)","v":"Papillons"},"Nombre individus",{"$f":"IF(ISBLANK('3-PAPILLONS'!D$56),\"\",'3-PAPILLONS'!D$56)","v":""},"out",{"$f":"'Synthese Annuelle Monitoring'!$Q$31","v":0}]
[{"$f":"'0-INFOS GENERALES A REMPLIR'!$B$4","v":2021},{"$f":"'0-INFOS GENERALES A REMPLIR'!$B$6","v":0},{"$f":"IF(ISBLANK('0-INFOS GENERALES A REMPLIR'!$E$13),\"\",'0-INFOS GENERALES A REMPLIR'!$E$13)","v":""},{"$f":"IF(ISBLANK('0-INFOS GENERALES A REMPLIR'!$A$13),\"\",'0-INFOS GENERALES A REMPLIR'!$A$13)","v":""},{"$f":"IF(ISBLANK('0-INFOS GENERALES A REMPLIR'!$D$13),\"\",'0-INFOS GENERALES A REMPLIR'!$D$13)","v":""},{"$f":"IFERROR(INDEX('listes valeurs'!F$2:F$552,MATCH(1,('listes valeurs'!B$2:B$552=B106)*('listes valeurs'!E$2:E$552=D106),0)),\"\")","v":""},null,null,null,null,{"$f":"'3-PAPILLONS'!$F$46","v":"Passage 2"},{"$f":"IF(ISBLANK('3-PAPILLONS'!$F$48),\"\",'3-PAPILLONS'!$F$48)","v":""},{"$f":"IF(ISBLANK('3-PAPILLONS'!$F$50),\"\",'3-PAPILLONS'!$F$50)","v":""},{"$f":"IF(ISBLANK('3-PAPILLONS'!$G$50),\"\",'3-PAPILLONS'!$G$50)","v":""},{"$f":"IF(ISBLANK('3-PAPILLONS'!$C$44),\"\",'3-PAPILLONS'!$C$44)","v":""},{"$f":"IF(ISBLANK('3-PAPILLONS'!$F$47),\"\",'3-PAPILLONS'!$F$47)","v":""},{"$f":"VLOOKUP('compilation données pour export'!$R106,'listes valeurs'!$X$2:$AA$3450,2,FALSE)","v":"Silène"},{"$f":"'3-PAPILLONS'!$A$20","v":"SIL"},{"$f":"VLOOKUP('compilation données pour export'!$R106,'listes valeurs'!$X$2:$AA$3450,4,FALSE)","v":"Brintesia circe"},{"$f":"VLOOKUP('compilation données pour export'!$R106,'listes valeurs'!$X$2:$AA$3450,3,FALSE)","v":"Papillons"},"Nombre individus",{"$f":"IF(ISBLANK('3-PAPILLONS'!F$56),\"\",'3-PAPILLONS'!F$56)","v":""},"in",{"$f":"'Synthese Annuelle Monitoring'!$Q$31","v":0}]
[{"$f":"'0-INFOS GENERALES A REMPLIR'!$B$4","v":2021},{"$f":"'0-INFOS GENERALES A REMPLIR'!$B$6","v":0},{"$f":"IF(ISBLANK('0-INFOS GENERALES A REMPLIR'!$E$13),\"\",'0-INFOS GENERALES A REMPLIR'!$E$13)","v":""},{"$f":"IF(ISBLANK('0-INFOS GENERALES A REMPLIR'!$A$13),\"\",'0-INFOS GENERALES A REMPLIR'!$A$13)","v":""},{"$f":"IF(ISBLANK('0-INFOS GENERALES A REMPLIR'!$D$13),\"\",'0-INFOS GENERALES A REMPLIR'!$D$13)","v":""},{"$f":"IFERROR(INDEX('listes valeurs'!F$2:F$552,MATCH(1,('listes valeurs'!B$2:B$552=B107)*('listes valeurs'!E$2:E$552=D107),0)),\"\")","v":""},null,null,null,null,{"$f":"'3-PAPILLONS'!$F$46","v":"Passage 2"},{"$f":"IF(ISBLANK('3-PAPILLONS'!$F$48),\"\",'3-PAPILLONS'!$F$48)","v":""},{"$f":"IF(ISBLANK('3-PAPILLONS'!$F$50),\"\",'3-PAPILLONS'!$F$50)","v":""},{"$f":"IF(ISBLANK('3-PAPILLONS'!$G$50),\"\",'3-PAPILLONS'!$G$50)","v":""},{"$f":"IF(ISBLANK('3-PAPILLONS'!$C$44),\"\",'3-PAPILLONS'!$C$44)","v":""},{"$f":"IF(ISBLANK('3-PAPILLONS'!$F$47),\"\",'3-PAPILLONS'!$F$47)","v":""},{"$f":"VLOOKUP('compilation données pour export'!$R107,'listes valeurs'!$X$2:$AA$3450,2,FALSE)","v":"Silène"},{"$f":"'3-PAPILLONS'!$A$20","v":"SIL"},{"$f":"VLOOKUP('compilation données pour export'!$R107,'listes valeurs'!$X$2:$AA$3450,4,FALSE)","v":"Brintesia circe"},{"$f":"VLOOKUP('compilation données pour export'!$R107,'listes valeurs'!$X$2:$AA$3450,3,FALSE)","v":"Papillons"},"Nombre individus",{"$f":"IF(ISBLANK('3-PAPILLONS'!G$56),\"\",'3-PAPILLONS'!G$56)","v":""},"out",{"$f":"'Synthese Annuelle Monitoring'!$Q$31","v":0}]
[{"$f":"'0-INFOS GENERALES A REMPLIR'!$B$4","v":2021},{"$f":"'0-INFOS GENERALES A REMPLIR'!$B$6","v":0},{"$f":"IF(ISBLANK('0-INFOS GENERALES A REMPLIR'!$E$14),\"\",'0-INFOS GENERALES A REMPLIR'!$E$14)","v":""},{"$f":"IF(ISBLANK('0-INFOS GENERALES A REMPLIR'!$A$14),\"\",'0-INFOS GENERALES A REMPLIR'!$A$14)","v":""},{"$f":"IF(ISBLANK('0-INFOS GENERALES A REMPLIR'!$D$14),\"\",'0-INFOS GENERALES A REMPLIR'!$D$14)","v":""},{"$f":"IFERROR(INDEX('listes valeurs'!F$2:F$552,MATCH(1,('listes valeurs'!B$2:B$552=B108)*('listes valeurs'!E$2:E$552=D108),0)),\"\")","v":""},null,null,null,null,{"$f":"'3-PAPILLONS'!$C$82","v":"Passage 1"},{"$f":"IF(ISBLANK('3-PAPILLONS'!$C$84),\"\",'3-PAPILLONS'!$C$84)","v":""},{"$f":"IF(ISBLANK('3-PAPILLONS'!$C$86),\"\",'3-PAPILLONS'!$C$86)","v":""},{"$f":"IF(ISBLANK('3-PAPILLONS'!$D$86),\"\",'3-PAPILLONS'!$D$86)","v":""},{"$f":"IF(ISBLANK('3-PAPILLONS'!$C$80),\"\",'3-PAPILLONS'!$C$80)","v":""},{"$f":"IF(ISBLANK('3-PAPILLONS'!$C$83),\"\",'3-PAPILLONS'!$C$83)","v":""},{"$f":"VLOOKUP('compilation données pour export'!$R108,'listes valeurs'!$X$2:$AA$3450,2,FALSE)","v":"Silène"},{"$f":"'3-PAPILLONS'!$A$20","v":"SIL"},{"$f":"VLOOKUP('compilation données pour export'!$R108,'listes valeurs'!$X$2:$AA$3450,4,FALSE)","v":"Brintesia circe"},{"$f":"VLOOKUP('compilation données pour export'!$R108,'listes valeurs'!$X$2:$AA$3450,3,FALSE)","v":"Papillons"},"Nombre individus",{"$f":"IF(ISBLANK('3-PAPILLONS'!C$92),\"\",'3-PAPILLONS'!C$92)","v":""},"in",{"$f":"'Synthese Annuelle Monitoring'!$Q$31","v":0}]
[{"$f":"'0-INFOS GENERALES A REMPLIR'!$B$4","v":2021},{"$f":"'0-INFOS GENERALES A REMPLIR'!$B$6","v":0},{"$f":"IF(ISBLANK('0-INFOS GENERALES A REMPLIR'!$E$14),\"\",'0-INFOS GENERALES A REMPLIR'!$E$14)","v":""},{"$f":"IF(ISBLANK('0-INFOS GENERALES A REMPLIR'!$A$14),\"\",'0-INFOS GENERALES A REMPLIR'!$A$14)","v":""},{"$f":"IF(ISBLANK('0-INFOS GENERALES A REMPLIR'!$D$14),\"\",'0-INFOS GENERALES A REMPLIR'!$D$14)","v":""},{"$f":"IFERROR(INDEX('listes valeurs'!F$2:F$552,MATCH(1,('listes valeurs'!B$2:B$552=B109)*('listes valeurs'!E$2:E$552=D109),0)),\"\")","v":""},null,null,null,null,{"$f":"'3-PAPILLONS'!$C$82","v":"Passage 1"},{"$f":"IF(ISBLANK('3-PAPILLONS'!$C$84),\"\",'3-PAPILLONS'!$C$84)","v":""},{"$f":"IF(ISBLANK('3-PAPILLONS'!$C$86),\"\",'3-PAPILLONS'!$C$86)","v":""},{"$f":"IF(ISBLANK('3-PAPILLONS'!$D$86),\"\",'3-PAPILLONS'!$D$86)","v":""},{"$f":"IF(ISBLANK('3-PAPILLONS'!$C$80),\"\",'3-PAPILLONS'!$C$80)","v":""},{"$f":"IF(ISBLANK('3-PAPILLONS'!$C$83),\"\",'3-PAPILLONS'!$C$83)","v":""},{"$f":"VLOOKUP('compilation données pour export'!$R109,'listes valeurs'!$X$2:$AA$3450,2,FALSE)","v":"Silène"},{"$f":"'3-PAPILLONS'!$A$20","v":"SIL"},{"$f":"VLOOKUP('compilation données pour export'!$R109,'listes valeurs'!$X$2:$AA$3450,4,FALSE)","v":"Brintesia circe"},{"$f":"VLOOKUP('compilation données pour export'!$R109,'listes valeurs'!$X$2:$AA$3450,3,FALSE)","v":"Papillons"},"Nombre individus",{"$f":"IF(ISBLANK('3-PAPILLONS'!D$92),\"\",'3-PAPILLONS'!D$92)","v":""},"out",{"$f":"'Synthese Annuelle Monitoring'!$Q$31","v":0}]
[{"$f":"'0-INFOS GENERALES A REMPLIR'!$B$4","v":2021},{"$f":"'0-INFOS GENERALES A REMPLIR'!$B$6","v":0},{"$f":"IF(ISBLANK('0-INFOS GENERALES A REMPLIR'!$E$14),\"\",'0-INFOS GENERALES A REMPLIR'!$E$14)","v":""},{"$f":"IF(ISBLANK('0-INFOS GENERALES A REMPLIR'!$A$14),\"\",'0-INFOS GENERALES A REMPLIR'!$A$14)","v":""},{"$f":"IF(ISBLANK('0-INFOS GENERALES A REMPLIR'!$D$14),\"\",'0-INFOS GENERALES A REMPLIR'!$D$14)","v":""},{"$f":"IFERROR(INDEX('listes valeurs'!F$2:F$552,MATCH(1,('listes valeurs'!B$2:B$552=B110)*('listes valeurs'!E$2:E$552=D110),0)),\"\")","v":""},null,null,null,null,{"$f":"'3-PAPILLONS'!$F$82","v":"Passage 2"},{"$f":"IF(ISBLANK('3-PAPILLONS'!$F$84),\"\",'3-PAPILLONS'!$F$84)","v":""},{"$f":"IF(ISBLANK('3-PAPILLONS'!$F$86),\"\",'3-PAPILLONS'!$F$86)","v":""},{"$f":"IF(ISBLANK('3-PAPILLONS'!$G$86),\"\",'3-PAPILLONS'!$G$86)","v":""},{"$f":"IF(ISBLANK('3-PAPILLONS'!$C$80),\"\",'3-PAPILLONS'!$C$80)","v":""},{"$f":"IF(ISBLANK('3-PAPILLONS'!$F$83),\"\",'3-PAPILLONS'!$F$83)","v":""},{"$f":"VLOOKUP('compilation données pour export'!$R110,'listes valeurs'!$X$2:$AA$3450,2,FALSE)","v":"Silène"},{"$f":"'3-PAPILLONS'!$A$20","v":"SIL"},{"$f":"VLOOKUP('compilation données pour export'!$R110,'listes valeurs'!$X$2:$AA$3450,4,FALSE)","v":"Brintesia circe"},{"$f":"VLOOKUP('compilation données pour export'!$R110,'listes valeurs'!$X$2:$AA$3450,3,FALSE)","v":"Papillons"},"Nombre individus",{"$f":"IF(ISBLANK('3-PAPILLONS'!F$92),\"\",'3-PAPILLONS'!F$92)","v":""},"in",{"$f":"'Synthese Annuelle Monitoring'!$Q$31","v":0}]
[{"$f":"'0-INFOS GENERALES A REMPLIR'!$B$4","v":2021},{"$f":"'0-INFOS GENERALES A REMPLIR'!$B$6","v":0},{"$f":"IF(ISBLANK('0-INFOS GENERALES A REMPLIR'!$E$14),\"\",'0-INFOS GENERALES A REMPLIR'!$E$14)","v":""},{"$f":"IF(ISBLANK('0-INFOS GENERALES A REMPLIR'!$A$14),\"\",'0-INFOS GENERALES A REMPLIR'!$A$14)","v":""},{"$f":"IF(ISBLANK('0-INFOS GENERALES A REMPLIR'!$D$14),\"\",'0-INFOS GENERALES A REMPLIR'!$D$14)","v":""},{"$f":"IFERROR(INDEX('listes valeurs'!F$2:F$552,MATCH(1,('listes valeurs'!B$2:B$552=B111)*('listes valeurs'!E$2:E$552=D111),0)),\"\")","v":""},null,null,null,null,{"$f":"'3-PAPILLONS'!$F$82","v":"Passage 2"},{"$f":"IF(ISBLANK('3-PAPILLONS'!$F$84),\"\",'3-PAPILLONS'!$F$84)","v":""},{"$f":"IF(ISBLANK('3-PAPILLONS'!$F$86),\"\",'3-PAPILLONS'!$F$86)","v":""},{"$f":"IF(ISBLANK('3-PAPILLONS'!$G$86),\"\",'3-PAPILLONS'!$G$86)","v":""},{"$f":"IF(ISBLANK('3-PAPILLONS'!$C$80),\"\",'3-PAPILLONS'!$C$80)","v":""},{"$f":"IF(ISBLANK('3-PAPILLONS'!$F$83),\"\",'3-PAPILLONS'!$F$83)","v":""},{"$f":"VLOOKUP('compilation données pour export'!$R111,'listes valeurs'!$X$2:$AA$3450,2,FALSE)","v":"Silène"},{"$f":"'3-PAPILLONS'!$A$20","v":"SIL"},{"$f":"VLOOKUP('compilation données pour export'!$R111,'listes valeurs'!$X$2:$AA$3450,4,FALSE)","v":"Brintesia circe"},{"$f":"VLOOKUP('compilation données pour export'!$R111,'listes valeurs'!$X$2:$AA$3450,3,FALSE)","v":"Papillons"},"Nombre individus",{"$f":"IF(ISBLANK('3-PAPILLONS'!G$92),\"\",'3-PAPILLONS'!G$92)","v":""},"out",{"$f":"'Synthese Annuelle Monitoring'!$Q$31","v":0}]
[{"$f":"'0-INFOS GENERALES A REMPLIR'!$B$4","v":2021},{"$f":"'0-INFOS GENERALES A REMPLIR'!$B$6","v":0},{"$f":"IF(ISBLANK('0-INFOS GENERALES A REMPLIR'!$E$15),\"\",'0-INFOS GENERALES A REMPLIR'!$E$15)","v":""},{"$f":"IF(ISBLANK('0-INFOS GENERALES A REMPLIR'!$A$15),\"\",'0-INFOS GENERALES A REMPLIR'!$A$15)","v":""},{"$f":"IF(ISBLANK('0-INFOS GENERALES A REMPLIR'!$D$15),\"\",'0-INFOS GENERALES A REMPLIR'!$D$15)","v":""},{"$f":"IFERROR(INDEX('listes valeurs'!F$2:F$552,MATCH(1,('listes valeurs'!B$2:B$552=B112)*('listes valeurs'!E$2:E$552=D112),0)),\"\")","v":""},null,null,null,null,{"$f":"'3-PAPILLONS'!$C$118","v":"Passage 1"},{"$f":"IF(ISBLANK('3-PAPILLONS'!$C$120),\"\",'3-PAPILLONS'!$C$120)","v":""},{"$f":"IF(ISBLANK('3-PAPILLONS'!$C$122),\"\",'3-PAPILLONS'!$C$122)","v":""},{"$f":"IF(ISBLANK('3-PAPILLONS'!$D$122),\"\",'3-PAPILLONS'!$D$122)","v":""},{"$f":"IF(ISBLANK('3-PAPILLONS'!$C$116),\"\",'3-PAPILLONS'!$C$116)","v":""},{"$f":"IF(ISBLANK('3-PAPILLONS'!$C$119),\"\",'3-PAPILLONS'!$C$119)","v":""},{"$f":"VLOOKUP('compilation données pour export'!$R112,'listes valeurs'!$X$2:$AA$3450,2,FALSE)","v":"Silène"},{"$f":"'3-PAPILLONS'!$A$20","v":"SIL"},{"$f":"VLOOKUP('compilation données pour export'!$R112,'listes valeurs'!$X$2:$AA$3450,4,FALSE)","v":"Brintesia circe"},{"$f":"VLOOKUP('compilation données pour export'!$R112,'listes valeurs'!$X$2:$AA$3450,3,FALSE)","v":"Papillons"},"Nombre individus",{"$f":"IF(ISBLANK('3-PAPILLONS'!C$128),\"\",'3-PAPILLONS'!C$128)","v":""},"in",{"$f":"'Synthese Annuelle Monitoring'!$Q$31","v":0}]
[{"$f":"'0-INFOS GENERALES A REMPLIR'!$B$4","v":2021},{"$f":"'0-INFOS GENERALES A REMPLIR'!$B$6","v":0},{"$f":"IF(ISBLANK('0-INFOS GENERALES A REMPLIR'!$E$15),\"\",'0-INFOS GENERALES A REMPLIR'!$E$15)","v":""},{"$f":"IF(ISBLANK('0-INFOS GENERALES A REMPLIR'!$A$15),\"\",'0-INFOS GENERALES A REMPLIR'!$A$15)","v":""},{"$f":"IF(ISBLANK('0-INFOS GENERALES A REMPLIR'!$D$15),\"\",'0-INFOS GENERALES A REMPLIR'!$D$15)","v":""},{"$f":"IFERROR(INDEX('listes valeurs'!F$2:F$552,MATCH(1,('listes valeurs'!B$2:B$552=B113)*('listes valeurs'!E$2:E$552=D113),0)),\"\")","v":""},null,null,null,null,{"$f":"'3-PAPILLONS'!$C$118","v":"Passage 1"},{"$f":"IF(ISBLANK('3-PAPILLONS'!$C$120),\"\",'3-PAPILLONS'!$C$120)","v":""},{"$f":"IF(ISBLANK('3-PAPILLONS'!$C$122),\"\",'3-PAPILLONS'!$C$122)","v":""},{"$f":"IF(ISBLANK('3-PAPILLONS'!$D$122),\"\",'3-PAPILLONS'!$D$122)","v":""},{"$f":"IF(ISBLANK('3-PAPILLONS'!$C$116),\"\",'3-PAPILLONS'!$C$116)","v":""},{"$f":"IF(ISBLANK('3-PAPILLONS'!$C$119),\"\",'3-PAPILLONS'!$C$119)","v":""},{"$f":"VLOOKUP('compilation données pour export'!$R113,'listes valeurs'!$X$2:$AA$3450,2,FALSE)","v":"Silène"},{"$f":"'3-PAPILLONS'!$A$20","v":"SIL"},{"$f":"VLOOKUP('compilation données pour export'!$R113,'listes valeurs'!$X$2:$AA$3450,4,FALSE)","v":"Brintesia circe"},{"$f":"VLOOKUP('compilation données pour export'!$R113,'listes valeurs'!$X$2:$AA$3450,3,FALSE)","v":"Papillons"},"Nombre individus",{"$f":"IF(ISBLANK('3-PAPILLONS'!D$128),\"\",'3-PAPILLONS'!D$128)","v":""},"out",{"$f":"'Synthese Annuelle Monitoring'!$Q$31","v":0}]
[{"$f":"'0-INFOS GENERALES A REMPLIR'!$B$4","v":2021},{"$f":"'0-INFOS GENERALES A REMPLIR'!$B$6","v":0},{"$f":"IF(ISBLANK('0-INFOS GENERALES A REMPLIR'!$E$15),\"\",'0-INFOS GENERALES A REMPLIR'!$E$15)","v":""},{"$f":"IF(ISBLANK('0-INFOS GENERALES A REMPLIR'!$A$15),\"\",'0-INFOS GENERALES A REMPLIR'!$A$15)","v":""},{"$f":"IF(ISBLANK('0-INFOS GENERALES A REMPLIR'!$D$15),\"\",'0-INFOS GENERALES A REMPLIR'!$D$15)","v":""},{"$f":"IFERROR(INDEX('listes valeurs'!F$2:F$552,MATCH(1,('listes valeurs'!B$2:B$552=B114)*('listes valeurs'!E$2:E$552=D114),0)),\"\")","v":""},null,null,null,null,{"$f":"'3-PAPILLONS'!$F$118","v":"Passage 2"},{"$f":"IF(ISBLANK('3-PAPILLONS'!$F$120),\"\",'3-PAPILLONS'!$F$120)","v":""},{"$f":"IF(ISBLANK('3-PAPILLONS'!$F$122),\"\",'3-PAPILLONS'!$F$122)","v":""},{"$f":"IF(ISBLANK('3-PAPILLONS'!$G$122),\"\",'3-PAPILLONS'!$G$122)","v":""},{"$f":"IF(ISBLANK('3-PAPILLONS'!$C$116),\"\",'3-PAPILLONS'!$C$116)","v":""},{"$f":"IF(ISBLANK('3-PAPILLONS'!$F$119),\"\",'3-PAPILLONS'!$F$119)","v":""},{"$f":"VLOOKUP('compilation données pour export'!$R114,'listes valeurs'!$X$2:$AA$3450,2,FALSE)","v":"Silène"},{"$f":"'3-PAPILLONS'!$A$20","v":"SIL"},{"$f":"VLOOKUP('compilation données pour export'!$R114,'listes valeurs'!$X$2:$AA$3450,4,FALSE)","v":"Brintesia circe"},{"$f":"VLOOKUP('compilation données pour export'!$R114,'listes valeurs'!$X$2:$AA$3450,3,FALSE)","v":"Papillons"},"Nombre individus",{"$f":"IF(ISBLANK('3-PAPILLONS'!F$128),\"\",'3-PAPILLONS'!F$128)","v":""},"in",{"$f":"'Synthese Annuelle Monitoring'!$Q$31","v":0}]
[{"$f":"'0-INFOS GENERALES A REMPLIR'!$B$4","v":2021},{"$f":"'0-INFOS GENERALES A REMPLIR'!$B$6","v":0},{"$f":"IF(ISBLANK('0-INFOS GENERALES A REMPLIR'!$E$15),\"\",'0-INFOS GENERALES A REMPLIR'!$E$15)","v":""},{"$f":"IF(ISBLANK('0-INFOS GENERALES A REMPLIR'!$A$15),\"\",'0-INFOS GENERALES A REMPLIR'!$A$15)","v":""},{"$f":"IF(ISBLANK('0-INFOS GENERALES A REMPLIR'!$D$15),\"\",'0-INFOS GENERALES A REMPLIR'!$D$15)","v":""},{"$f":"IFERROR(INDEX('listes valeurs'!F$2:F$552,MATCH(1,('listes valeurs'!B$2:B$552=B115)*('listes valeurs'!E$2:E$552=D115),0)),\"\")","v":""},null,null,null,null,{"$f":"'3-PAPILLONS'!$F$118","v":"Passage 2"},{"$f":"IF(ISBLANK('3-PAPILLONS'!$F$120),\"\",'3-PAPILLONS'!$F$120)","v":""},{"$f":"IF(ISBLANK('3-PAPILLONS'!$F$122),\"\",'3-PAPILLONS'!$F$122)","v":""},{"$f":"IF(ISBLANK('3-PAPILLONS'!$G$122),\"\",'3-PAPILLONS'!$G$122)","v":""},{"$f":"IF(ISBLANK('3-PAPILLONS'!$C$116),\"\",'3-PAPILLONS'!$C$116)","v":""},{"$f":"IF(ISBLANK('3-PAPILLONS'!$F$119),\"\",'3-PAPILLONS'!$F$119)","v":""},{"$f":"VLOOKUP('compilation données pour export'!$R115,'listes valeurs'!$X$2:$AA$3450,2,FALSE)","v":"Silène"},{"$f":"'3-PAPILLONS'!$A$20","v":"SIL"},{"$f":"VLOOKUP('compilation données pour export'!$R115,'listes valeurs'!$X$2:$AA$3450,4,FALSE)","v":"Brintesia circe"},{"$f":"VLOOKUP('compilation données pour export'!$R115,'listes valeurs'!$X$2:$AA$3450,3,FALSE)","v":"Papillons"},"Nombre individus",{"$f":"IF(ISBLANK('3-PAPILLONS'!G$128),\"\",'3-PAPILLONS'!G$128)","v":""},"out",{"$f":"'Synthese Annuelle Monitoring'!$Q$31","v":0}]
[{"$f":"'0-INFOS GENERALES A REMPLIR'!$B$4","v":2021},{"$f":"'0-INFOS GENERALES A REMPLIR'!$B$6","v":0},{"$f":"IF(ISBLANK('0-INFOS GENERALES A REMPLIR'!$E$16),\"\",'0-INFOS GENERALES A REMPLIR'!$E$16)","v":""},{"$f":"IF(ISBLANK('0-INFOS GENERALES A REMPLIR'!$A$16),\"\",'0-INFOS GENERALES A REMPLIR'!$A$16)","v":""},{"$f":"IF(ISBLANK('0-INFOS GENERALES A REMPLIR'!$D$16),\"\",'0-INFOS GENERALES A REMPLIR'!$D$16)","v":""},{"$f":"IFERROR(INDEX('listes valeurs'!F$2:F$552,MATCH(1,('listes valeurs'!B$2:B$552=B116)*('listes valeurs'!E$2:E$552=D116),0)),\"\")","v":""},null,null,null,null,{"$f":"'3-PAPILLONS'!$C$154","v":"Passage 1"},{"$f":"IF(ISBLANK('3-PAPILLONS'!$C$156),\"\",'3-PAPILLONS'!$C$156)","v":""},{"$f":"IF(ISBLANK('3-PAPILLONS'!$C$158),\"\",'3-PAPILLONS'!$C$158)","v":""},{"$f":"IF(ISBLANK('3-PAPILLONS'!$D$158),\"\",'3-PAPILLONS'!$D$158)","v":""},{"$f":"IF(ISBLANK('3-PAPILLONS'!$C$152),\"\",'3-PAPILLONS'!$C$152)","v":""},{"$f":"IF(ISBLANK('3-PAPILLONS'!$C$155),\"\",'3-PAPILLONS'!$C$155)","v":""},{"$f":"VLOOKUP('compilation données pour export'!$R116,'listes valeurs'!$X$2:$AA$3450,2,FALSE)","v":"Silène"},{"$f":"'3-PAPILLONS'!$A$20","v":"SIL"},{"$f":"VLOOKUP('compilation données pour export'!$R116,'listes valeurs'!$X$2:$AA$3450,4,FALSE)","v":"Brintesia circe"},{"$f":"VLOOKUP('compilation données pour export'!$R116,'listes valeurs'!$X$2:$AA$3450,3,FALSE)","v":"Papillons"},"Nombre individus",{"$f":"IF(ISBLANK('3-PAPILLONS'!C$164),\"\",'3-PAPILLONS'!C$164)","v":""},"in",{"$f":"'Synthese Annuelle Monitoring'!$Q$31","v":0}]
[{"$f":"'0-INFOS GENERALES A REMPLIR'!$B$4","v":2021},{"$f":"'0-INFOS GENERALES A REMPLIR'!$B$6","v":0},{"$f":"IF(ISBLANK('0-INFOS GENERALES A REMPLIR'!$E$16),\"\",'0-INFOS GENERALES A REMPLIR'!$E$16)","v":""},{"$f":"IF(ISBLANK('0-INFOS GENERALES A REMPLIR'!$A$16),\"\",'0-INFOS GENERALES A REMPLIR'!$A$16)","v":""},{"$f":"IF(ISBLANK('0-INFOS GENERALES A REMPLIR'!$D$16),\"\",'0-INFOS GENERALES A REMPLIR'!$D$16)","v":""},{"$f":"IFERROR(INDEX('listes valeurs'!F$2:F$552,MATCH(1,('listes valeurs'!B$2:B$552=B117)*('listes valeurs'!E$2:E$552=D117),0)),\"\")","v":""},null,null,null,null,{"$f":"'3-PAPILLONS'!$C$154","v":"Passage 1"},{"$f":"IF(ISBLANK('3-PAPILLONS'!$C$156),\"\",'3-PAPILLONS'!$C$156)","v":""},{"$f":"IF(ISBLANK('3-PAPILLONS'!$C$158),\"\",'3-PAPILLONS'!$C$158)","v":""},{"$f":"IF(ISBLANK('3-PAPILLONS'!$D$158),\"\",'3-PAPILLONS'!$D$158)","v":""},{"$f":"IF(ISBLANK('3-PAPILLONS'!$C$152),\"\",'3-PAPILLONS'!$C$152)","v":""},{"$f":"IF(ISBLANK('3-PAPILLONS'!$C$155),\"\",'3-PAPILLONS'!$C$155)","v":""},{"$f":"VLOOKUP('compilation données pour export'!$R117,'listes valeurs'!$X$2:$AA$3450,2,FALSE)","v":"Silène"},{"$f":"'3-PAPILLONS'!$A$20","v":"SIL"},{"$f":"VLOOKUP('compilation données pour export'!$R117,'listes valeurs'!$X$2:$AA$3450,4,FALSE)","v":"Brintesia circe"},{"$f":"VLOOKUP('compilation données pour export'!$R117,'listes valeurs'!$X$2:$AA$3450,3,FALSE)","v":"Papillons"},"Nombre individus",{"$f":"IF(ISBLANK('3-PAPILLONS'!D$164),\"\",'3-PAPILLONS'!D$164)","v":""},"out",{"$f":"'Synthese Annuelle Monitoring'!$Q$31","v":0}]
[{"$f":"'0-INFOS GENERALES A REMPLIR'!$B$4","v":2021},{"$f":"'0-INFOS GENERALES A REMPLIR'!$B$6","v":0},{"$f":"IF(ISBLANK('0-INFOS GENERALES A REMPLIR'!$E$16),\"\",'0-INFOS GENERALES A REMPLIR'!$E$16)","v":""},{"$f":"IF(ISBLANK('0-INFOS GENERALES A REMPLIR'!$A$16),\"\",'0-INFOS GENERALES A REMPLIR'!$A$16)","v":""},{"$f":"IF(ISBLANK('0-INFOS GENERALES A REMPLIR'!$D$16),\"\",'0-INFOS GENERALES A REMPLIR'!$D$16)","v":""},{"$f":"IFERROR(INDEX('listes valeurs'!F$2:F$552,MATCH(1,('listes valeurs'!B$2:B$552=B118)*('listes valeurs'!E$2:E$552=D118),0)),\"\")","v":""},null,null,null,null,{"$f":"'3-PAPILLONS'!$F$154","v":"Passage 2"},{"$f":"IF(ISBLANK('3-PAPILLONS'!$F$156),\"\",'3-PAPILLONS'!$F$156)","v":""},{"$f":"IF(ISBLANK('3-PAPILLONS'!$F$158),\"\",'3-PAPILLONS'!$F$158)","v":""},{"$f":"IF(ISBLANK('3-PAPILLONS'!$G$158),\"\",'3-PAPILLONS'!$G$158)","v":""},{"$f":"IF(ISBLANK('3-PAPILLONS'!$C$152),\"\",'3-PAPILLONS'!$C$152)","v":""},{"$f":"IF(ISBLANK('3-PAPILLONS'!$F$155),\"\",'3-PAPILLONS'!$F$155)","v":""},{"$f":"VLOOKUP('compilation données pour export'!$R118,'listes valeurs'!$X$2:$AA$3450,2,FALSE)","v":"Silène"},{"$f":"'3-PAPILLONS'!$A$20","v":"SIL"},{"$f":"VLOOKUP('compilation données pour export'!$R118,'listes valeurs'!$X$2:$AA$3450,4,FALSE)","v":"Brintesia circe"},{"$f":"VLOOKUP('compilation données pour export'!$R118,'listes valeurs'!$X$2:$AA$3450,3,FALSE)","v":"Papillons"},"Nombre individus",{"$f":"IF(ISBLANK('3-PAPILLONS'!F$164),\"\",'3-PAPILLONS'!F$164)","v":""},"in",{"$f":"'Synthese Annuelle Monitoring'!$Q$31","v":0}]
[{"$f":"'0-INFOS GENERALES A REMPLIR'!$B$4","v":2021},{"$f":"'0-INFOS GENERALES A REMPLIR'!$B$6","v":0},{"$f":"IF(ISBLANK('0-INFOS GENERALES A REMPLIR'!$E$16),\"\",'0-INFOS GENERALES A REMPLIR'!$E$16)","v":""},{"$f":"IF(ISBLANK('0-INFOS GENERALES A REMPLIR'!$A$16),\"\",'0-INFOS GENERALES A REMPLIR'!$A$16)","v":""},{"$f":"IF(ISBLANK('0-INFOS GENERALES A REMPLIR'!$D$16),\"\",'0-INFOS GENERALES A REMPLIR'!$D$16)","v":""},{"$f":"IFERROR(INDEX('listes valeurs'!F$2:F$552,MATCH(1,('listes valeurs'!B$2:B$552=B119)*('listes valeurs'!E$2:E$552=D119),0)),\"\")","v":""},null,null,null,null,{"$f":"'3-PAPILLONS'!$F$154","v":"Passage 2"},{"$f":"IF(ISBLANK('3-PAPILLONS'!$F$156),\"\",'3-PAPILLONS'!$F$156)","v":""},{"$f":"IF(ISBLANK('3-PAPILLONS'!$F$158),\"\",'3-PAPILLONS'!$F$158)","v":""},{"$f":"IF(ISBLANK('3-PAPILLONS'!$G$158),\"\",'3-PAPILLONS'!$G$158)","v":""},{"$f":"IF(ISBLANK('3-PAPILLONS'!$C$152),\"\",'3-PAPILLONS'!$C$152)","v":""},{"$f":"IF(ISBLANK('3-PAPILLONS'!$F$155),\"\",'3-PAPILLONS'!$F$155)","v":""},{"$f":"VLOOKUP('compilation données pour export'!$R119,'listes valeurs'!$X$2:$AA$3450,2,FALSE)","v":"Silène"},{"$f":"'3-PAPILLONS'!$A$20","v":"SIL"},{"$f":"VLOOKUP('compilation données pour export'!$R119,'listes valeurs'!$X$2:$AA$3450,4,FALSE)","v":"Brintesia circe"},{"$f":"VLOOKUP('compilation données pour export'!$R119,'listes valeurs'!$X$2:$AA$3450,3,FALSE)","v":"Papillons"},"Nombre individus",{"$f":"IF(ISBLANK('3-PAPILLONS'!G$164),\"\",'3-PAPILLONS'!G$164)","v":""},"out",{"$f":"'Synthese Annuelle Monitoring'!$Q$31","v":0}]
[{"$f":"'0-INFOS GENERALES A REMPLIR'!$B$4","v":2021},{"$f":"'0-INFOS GENERALES A REMPLIR'!$B$6","v":0},{"$f":"IF(ISBLANK('0-INFOS GENERALES A REMPLIR'!$E$12),\"\",'0-INFOS GENERALES A REMPLIR'!$E$12)","v":""},{"$f":"IF(ISBLANK('0-INFOS GENERALES A REMPLIR'!$A$12),\"\",'0-INFOS GENERALES A REMPLIR'!$A$12)","v":""},{"$f":"IF(ISBLANK('0-INFOS GENERALES A REMPLIR'!$D$12),\"\",'0-INFOS GENERALES A REMPLIR'!$D$12)","v":""},{"$f":"IFERROR(INDEX('listes valeurs'!F$2:F$552,MATCH(1,('listes valeurs'!B$2:B$552=B120)*('listes valeurs'!E$2:E$552=D120),0)),\"\")","v":""},null,null,null,null,{"$f":"'3-PAPILLONS'!$C$10","v":"Passage 1"},{"$f":"IF(ISBLANK('3-PAPILLONS'!$C$12),\"\",'3-PAPILLONS'!$C$12)","v":""},{"$f":"IF(ISBLANK('3-PAPILLONS'!$C$14),\"\",'3-PAPILLONS'!$C$14)","v":""},{"$f":"IF(ISBLANK('3-PAPILLONS'!$D$14),\"\",'3-PAPILLONS'!$D$14)","v":""},{"$f":"IF(ISBLANK('3-PAPILLONS'!$C$8),\"\",'3-PAPILLONS'!$C$8)","v":""},{"$f":"IF(ISBLANK('3-PAPILLONS'!$C$11),\"\",'3-PAPILLONS'!$C$11)","v":""},{"$f":"VLOOKUP('compilation données pour export'!$R120,'listes valeurs'!$X$2:$AA$3450,2,FALSE)","v":"Tristan"},{"$f":"'3-PAPILLONS'!$A$21","v":"TRI"},{"$f":"VLOOKUP('compilation données pour export'!$R120,'listes valeurs'!$X$2:$AA$3450,4,FALSE)","v":"Aphantopus hyperantus"},{"$f":"VLOOKUP('compilation données pour export'!$R120,'listes valeurs'!$X$2:$AA$3450,3,FALSE)","v":"Papillons"},"Nombre individus",{"$f":"IF(ISBLANK('3-PAPILLONS'!C$21),\"\",'3-PAPILLONS'!C$21)","v":""},"in",{"$f":"'Synthese Annuelle Monitoring'!$Q$32","v":0}]
[{"$f":"'0-INFOS GENERALES A REMPLIR'!$B$4","v":2021},{"$f":"'0-INFOS GENERALES A REMPLIR'!$B$6","v":0},{"$f":"IF(ISBLANK('0-INFOS GENERALES A REMPLIR'!$E$12),\"\",'0-INFOS GENERALES A REMPLIR'!$E$12)","v":""},{"$f":"IF(ISBLANK('0-INFOS GENERALES A REMPLIR'!$A$12),\"\",'0-INFOS GENERALES A REMPLIR'!$A$12)","v":""},{"$f":"IF(ISBLANK('0-INFOS GENERALES A REMPLIR'!$D$12),\"\",'0-INFOS GENERALES A REMPLIR'!$D$12)","v":""},{"$f":"IFERROR(INDEX('listes valeurs'!F$2:F$552,MATCH(1,('listes valeurs'!B$2:B$552=B121)*('listes valeurs'!E$2:E$552=D121),0)),\"\")","v":""},null,null,null,null,{"$f":"'3-PAPILLONS'!$C$10","v":"Passage 1"},{"$f":"IF(ISBLANK('3-PAPILLONS'!$C$12),\"\",'3-PAPILLONS'!$C$12)","v":""},{"$f":"IF(ISBLANK('3-PAPILLONS'!$C$14),\"\",'3-PAPILLONS'!$C$14)","v":""},{"$f":"IF(ISBLANK('3-PAPILLONS'!$D$14),\"\",'3-PAPILLONS'!$D$14)","v":""},{"$f":"IF(ISBLANK('3-PAPILLONS'!$C$8),\"\",'3-PAPILLONS'!$C$8)","v":""},{"$f":"IF(ISBLANK('3-PAPILLONS'!$C$11),\"\",'3-PAPILLONS'!$C$11)","v":""},{"$f":"VLOOKUP('compilation données pour export'!$R121,'listes valeurs'!$X$2:$AA$3450,2,FALSE)","v":"Tristan"},{"$f":"'3-PAPILLONS'!$A$21","v":"TRI"},{"$f":"VLOOKUP('compilation données pour export'!$R121,'listes valeurs'!$X$2:$AA$3450,4,FALSE)","v":"Aphantopus hyperantus"},{"$f":"VLOOKUP('compilation données pour export'!$R121,'listes valeurs'!$X$2:$AA$3450,3,FALSE)","v":"Papillons"},"Nombre individus",{"$f":"IF(ISBLANK('3-PAPILLONS'!D$21),\"\",'3-PAPILLONS'!D$21)","v":""},"out",{"$f":"'Synthese Annuelle Monitoring'!$Q$32","v":0}]
[{"$f":"'0-INFOS GENERALES A REMPLIR'!$B$4","v":2021},{"$f":"'0-INFOS GENERALES A REMPLIR'!$B$6","v":0},{"$f":"IF(ISBLANK('0-INFOS GENERALES A REMPLIR'!$E$12),\"\",'0-INFOS GENERALES A REMPLIR'!$E$12)","v":""},{"$f":"IF(ISBLANK('0-INFOS GENERALES A REMPLIR'!$A$12),\"\",'0-INFOS GENERALES A REMPLIR'!$A$12)","v":""},{"$f":"IF(ISBLANK('0-INFOS GENERALES A REMPLIR'!$D$12),\"\",'0-INFOS GENERALES A REMPLIR'!$D$12)","v":""},{"$f":"IFERROR(INDEX('listes valeurs'!F$2:F$552,MATCH(1,('listes valeurs'!B$2:B$552=B122)*('listes valeurs'!E$2:E$552=D122),0)),\"\")","v":""},null,null,null,null,{"$f":"'3-PAPILLONS'!$F$10","v":"Passage 2"},{"$f":"IF(ISBLANK('3-PAPILLONS'!$F$12),\"\",'3-PAPILLONS'!$F$12)","v":""},{"$f":"IF(ISBLANK('3-PAPILLONS'!$F$14),\"\",'3-PAPILLONS'!$F$14)","v":""},{"$f":"IF(ISBLANK('3-PAPILLONS'!$G$14),\"\",'3-PAPILLONS'!$G$14)","v":""},{"$f":"IF(ISBLANK('3-PAPILLONS'!$C$8),\"\",'3-PAPILLONS'!$C$8)","v":""},{"$f":"IF(ISBLANK('3-PAPILLONS'!$F$11),\"\",'3-PAPILLONS'!$F$11)","v":""},{"$f":"VLOOKUP('compilation données pour export'!$R122,'listes valeurs'!$X$2:$AA$3450,2,FALSE)","v":"Tristan"},{"$f":"'3-PAPILLONS'!$A$21","v":"TRI"},{"$f":"VLOOKUP('compilation données pour export'!$R122,'listes valeurs'!$X$2:$AA$3450,4,FALSE)","v":"Aphantopus hyperantus"},{"$f":"VLOOKUP('compilation données pour export'!$R122,'listes valeurs'!$X$2:$AA$3450,3,FALSE)","v":"Papillons"},"Nombre individus",{"$f":"IF(ISBLANK('3-PAPILLONS'!F$21),\"\",'3-PAPILLONS'!F$21)","v":""},"in",{"$f":"'Synthese Annuelle Monitoring'!$Q$32","v":0}]
[{"$f":"'0-INFOS GENERALES A REMPLIR'!$B$4","v":2021},{"$f":"'0-INFOS GENERALES A REMPLIR'!$B$6","v":0},{"$f":"IF(ISBLANK('0-INFOS GENERALES A REMPLIR'!$E$12),\"\",'0-INFOS GENERALES A REMPLIR'!$E$12)","v":""},{"$f":"IF(ISBLANK('0-INFOS GENERALES A REMPLIR'!$A$12),\"\",'0-INFOS GENERALES A REMPLIR'!$A$12)","v":""},{"$f":"IF(ISBLANK('0-INFOS GENERALES A REMPLIR'!$D$12),\"\",'0-INFOS GENERALES A REMPLIR'!$D$12)","v":""},{"$f":"IFERROR(INDEX('listes valeurs'!F$2:F$552,MATCH(1,('listes valeurs'!B$2:B$552=B123)*('listes valeurs'!E$2:E$552=D123),0)),\"\")","v":""},null,null,null,null,{"$f":"'3-PAPILLONS'!$F$10","v":"Passage 2"},{"$f":"IF(ISBLANK('3-PAPILLONS'!$F$12),\"\",'3-PAPILLONS'!$F$12)","v":""},{"$f":"IF(ISBLANK('3-PAPILLONS'!$F$14),\"\",'3-PAPILLONS'!$F$14)","v":""},{"$f":"IF(ISBLANK('3-PAPILLONS'!$G$14),\"\",'3-PAPILLONS'!$G$14)","v":""},{"$f":"IF(ISBLANK('3-PAPILLONS'!$C$8),\"\",'3-PAPILLONS'!$C$8)","v":""},{"$f":"IF(ISBLANK('3-PAPILLONS'!$F$11),\"\",'3-PAPILLONS'!$F$11)","v":""},{"$f":"VLOOKUP('compilation données pour export'!$R123,'listes valeurs'!$X$2:$AA$3450,2,FALSE)","v":"Tristan"},{"$f":"'3-PAPILLONS'!$A$21","v":"TRI"},{"$f":"VLOOKUP('compilation données pour export'!$R123,'listes valeurs'!$X$2:$AA$3450,4,FALSE)","v":"Aphantopus hyperantus"},{"$f":"VLOOKUP('compilation données pour export'!$R123,'listes valeurs'!$X$2:$AA$3450,3,FALSE)","v":"Papillons"},"Nombre individus",{"$f":"IF(ISBLANK('3-PAPILLONS'!G$21),\"\",'3-PAPILLONS'!G$21)","v":""},"out",{"$f":"'Synthese Annuelle Monitoring'!$Q$32","v":0}]
[{"$f":"'0-INFOS GENERALES A REMPLIR'!$B$4","v":2021},{"$f":"'0-INFOS GENERALES A REMPLIR'!$B$6","v":0},{"$f":"IF(ISBLANK('0-INFOS GENERALES A REMPLIR'!$E$13),\"\",'0-INFOS GENERALES A REMPLIR'!$E$13)","v":""},{"$f":"IF(ISBLANK('0-INFOS GENERALES A REMPLIR'!$A$13),\"\",'0-INFOS GENERALES A REMPLIR'!$A$13)","v":""},{"$f":"IF(ISBLANK('0-INFOS GENERALES A REMPLIR'!$D$13),\"\",'0-INFOS GENERALES A REMPLIR'!$D$13)","v":""},{"$f":"IFERROR(INDEX('listes valeurs'!F$2:F$552,MATCH(1,('listes valeurs'!B$2:B$552=B124)*('listes valeurs'!E$2:E$552=D124),0)),\"\")","v":""},null,null,null,null,{"$f":"'3-PAPILLONS'!$C$46","v":"Passage 1"},{"$f":"IF(ISBLANK('3-PAPILLONS'!$C$48),\"\",'3-PAPILLONS'!$C$48)","v":""},{"$f":"IF(ISBLANK('3-PAPILLONS'!$C$50),\"\",'3-PAPILLONS'!$C$50)","v":""},{"$f":"IF(ISBLANK('3-PAPILLONS'!$D$50),\"\",'3-PAPILLONS'!$D$50)","v":""},{"$f":"IF(ISBLANK('3-PAPILLONS'!$C$44),\"\",'3-PAPILLONS'!$C$44)","v":""},{"$f":"IF(ISBLANK('3-PAPILLONS'!$C$47),\"\",'3-PAPILLONS'!$C$47)","v":""},{"$f":"VLOOKUP('compilation données pour export'!$R124,'listes valeurs'!$X$2:$AA$3450,2,FALSE)","v":"Tristan"},{"$f":"'3-PAPILLONS'!$A$21","v":"TRI"},{"$f":"VLOOKUP('compilation données pour export'!$R124,'listes valeurs'!$X$2:$AA$3450,4,FALSE)","v":"Aphantopus hyperantus"},{"$f":"VLOOKUP('compilation données pour export'!$R124,'listes valeurs'!$X$2:$AA$3450,3,FALSE)","v":"Papillons"},"Nombre individus",{"$f":"IF(ISBLANK('3-PAPILLONS'!C$57),\"\",'3-PAPILLONS'!C$57)","v":""},"in",{"$f":"'Synthese Annuelle Monitoring'!$Q$32","v":0}]
[{"$f":"'0-INFOS GENERALES A REMPLIR'!$B$4","v":2021},{"$f":"'0-INFOS GENERALES A REMPLIR'!$B$6","v":0},{"$f":"IF(ISBLANK('0-INFOS GENERALES A REMPLIR'!$E$13),\"\",'0-INFOS GENERALES A REMPLIR'!$E$13)","v":""},{"$f":"IF(ISBLANK('0-INFOS GENERALES A REMPLIR'!$A$13),\"\",'0-INFOS GENERALES A REMPLIR'!$A$13)","v":""},{"$f":"IF(ISBLANK('0-INFOS GENERALES A REMPLIR'!$D$13),\"\",'0-INFOS GENERALES A REMPLIR'!$D$13)","v":""},{"$f":"IFERROR(INDEX('listes valeurs'!F$2:F$552,MATCH(1,('listes valeurs'!B$2:B$552=B125)*('listes valeurs'!E$2:E$552=D125),0)),\"\")","v":""},null,null,null,null,{"$f":"'3-PAPILLONS'!$C$46","v":"Passage 1"},{"$f":"IF(ISBLANK('3-PAPILLONS'!$C$48),\"\",'3-PAPILLONS'!$C$48)","v":""},{"$f":"IF(ISBLANK('3-PAPILLONS'!$C$50),\"\",'3-PAPILLONS'!$C$50)","v":""},{"$f":"IF(ISBLANK('3-PAPILLONS'!$D$50),\"\",'3-PAPILLONS'!$D$50)","v":""},{"$f":"IF(ISBLANK('3-PAPILLONS'!$C$44),\"\",'3-PAPILLONS'!$C$44)","v":""},{"$f":"IF(ISBLANK('3-PAPILLONS'!$C$47),\"\",'3-PAPILLONS'!$C$47)","v":""},{"$f":"VLOOKUP('compilation données pour export'!$R125,'listes valeurs'!$X$2:$AA$3450,2,FALSE)","v":"Tristan"},{"$f":"'3-PAPILLONS'!$A$21","v":"TRI"},{"$f":"VLOOKUP('compilation données pour export'!$R125,'listes valeurs'!$X$2:$AA$3450,4,FALSE)","v":"Aphantopus hyperantus"},{"$f":"VLOOKUP('compilation données pour export'!$R125,'listes valeurs'!$X$2:$AA$3450,3,FALSE)","v":"Papillons"},"Nombre individus",{"$f":"IF(ISBLANK('3-PAPILLONS'!D$57),\"\",'3-PAPILLONS'!D$57)","v":""},"out",{"$f":"'Synthese Annuelle Monitoring'!$Q$32","v":0}]
[{"$f":"'0-INFOS GENERALES A REMPLIR'!$B$4","v":2021},{"$f":"'0-INFOS GENERALES A REMPLIR'!$B$6","v":0},{"$f":"IF(ISBLANK('0-INFOS GENERALES A REMPLIR'!$E$13),\"\",'0-INFOS GENERALES A REMPLIR'!$E$13)","v":""},{"$f":"IF(ISBLANK('0-INFOS GENERALES A REMPLIR'!$A$13),\"\",'0-INFOS GENERALES A REMPLIR'!$A$13)","v":""},{"$f":"IF(ISBLANK('0-INFOS GENERALES A REMPLIR'!$D$13),\"\",'0-INFOS GENERALES A REMPLIR'!$D$13)","v":""},{"$f":"IFERROR(INDEX('listes valeurs'!F$2:F$552,MATCH(1,('listes valeurs'!B$2:B$552=B126)*('listes valeurs'!E$2:E$552=D126),0)),\"\")","v":""},null,null,null,null,{"$f":"'3-PAPILLONS'!$F$46","v":"Passage 2"},{"$f":"IF(ISBLANK('3-PAPILLONS'!$F$48),\"\",'3-PAPILLONS'!$F$48)","v":""},{"$f":"IF(ISBLANK('3-PAPILLONS'!$F$50),\"\",'3-PAPILLONS'!$F$50)","v":""},{"$f":"IF(ISBLANK('3-PAPILLONS'!$G$50),\"\",'3-PAPILLONS'!$G$50)","v":""},{"$f":"IF(ISBLANK('3-PAPILLONS'!$C$44),\"\",'3-PAPILLONS'!$C$44)","v":""},{"$f":"IF(ISBLANK('3-PAPILLONS'!$F$47),\"\",'3-PAPILLONS'!$F$47)","v":""},{"$f":"VLOOKUP('compilation données pour export'!$R126,'listes valeurs'!$X$2:$AA$3450,2,FALSE)","v":"Tristan"},{"$f":"'3-PAPILLONS'!$A$21","v":"TRI"},{"$f":"VLOOKUP('compilation données pour export'!$R126,'listes valeurs'!$X$2:$AA$3450,4,FALSE)","v":"Aphantopus hyperantus"},{"$f":"VLOOKUP('compilation données pour export'!$R126,'listes valeurs'!$X$2:$AA$3450,3,FALSE)","v":"Papillons"},"Nombre individus",{"$f":"IF(ISBLANK('3-PAPILLONS'!F$57),\"\",'3-PAPILLONS'!F$57)","v":""},"in",{"$f":"'Synthese Annuelle Monitoring'!$Q$32","v":0}]
[{"$f":"'0-INFOS GENERALES A REMPLIR'!$B$4","v":2021},{"$f":"'0-INFOS GENERALES A REMPLIR'!$B$6","v":0},{"$f":"IF(ISBLANK('0-INFOS GENERALES A REMPLIR'!$E$13),\"\",'0-INFOS GENERALES A REMPLIR'!$E$13)","v":""},{"$f":"IF(ISBLANK('0-INFOS GENERALES A REMPLIR'!$A$13),\"\",'0-INFOS GENERALES A REMPLIR'!$A$13)","v":""},{"$f":"IF(ISBLANK('0-INFOS GENERALES A REMPLIR'!$D$13),\"\",'0-INFOS GENERALES A REMPLIR'!$D$13)","v":""},{"$f":"IFERROR(INDEX('listes valeurs'!F$2:F$552,MATCH(1,('listes valeurs'!B$2:B$552=B127)*('listes valeurs'!E$2:E$552=D127),0)),\"\")","v":""},null,null,null,null,{"$f":"'3-PAPILLONS'!$F$46","v":"Passage 2"},{"$f":"IF(ISBLANK('3-PAPILLONS'!$F$48),\"\",'3-PAPILLONS'!$F$48)","v":""},{"$f":"IF(ISBLANK('3-PAPILLONS'!$F$50),\"\",'3-PAPILLONS'!$F$50)","v":""},{"$f":"IF(ISBLANK('3-PAPILLONS'!$G$50),\"\",'3-PAPILLONS'!$G$50)","v":""},{"$f":"IF(ISBLANK('3-PAPILLONS'!$C$44),\"\",'3-PAPILLONS'!$C$44)","v":""},{"$f":"IF(ISBLANK('3-PAPILLONS'!$F$47),\"\",'3-PAPILLONS'!$F$47)","v":""},{"$f":"VLOOKUP('compilation données pour export'!$R127,'listes valeurs'!$X$2:$AA$3450,2,FALSE)","v":"Tristan"},{"$f":"'3-PAPILLONS'!$A$21","v":"TRI"},{"$f":"VLOOKUP('compilation données pour export'!$R127,'listes valeurs'!$X$2:$AA$3450,4,FALSE)","v":"Aphantopus hyperantus"},{"$f":"VLOOKUP('compilation données pour export'!$R127,'listes valeurs'!$X$2:$AA$3450,3,FALSE)","v":"Papillons"},"Nombre individus",{"$f":"IF(ISBLANK('3-PAPILLONS'!G$57),\"\",'3-PAPILLONS'!G$57)","v":""},"out",{"$f":"'Synthese Annuelle Monitoring'!$Q$32","v":0}]
[{"$f":"'0-INFOS GENERALES A REMPLIR'!$B$4","v":2021},{"$f":"'0-INFOS GENERALES A REMPLIR'!$B$6","v":0},{"$f":"IF(ISBLANK('0-INFOS GENERALES A REMPLIR'!$E$14),\"\",'0-INFOS GENERALES A REMPLIR'!$E$14)","v":""},{"$f":"IF(ISBLANK('0-INFOS GENERALES A REMPLIR'!$A$14),\"\",'0-INFOS GENERALES A REMPLIR'!$A$14)","v":""},{"$f":"IF(ISBLANK('0-INFOS GENERALES A REMPLIR'!$D$14),\"\",'0-INFOS GENERALES A REMPLIR'!$D$14)","v":""},{"$f":"IFERROR(INDEX('listes valeurs'!F$2:F$552,MATCH(1,('listes valeurs'!B$2:B$552=B128)*('listes valeurs'!E$2:E$552=D128),0)),\"\")","v":""},null,null,null,null,{"$f":"'3-PAPILLONS'!$C$82","v":"Passage 1"},{"$f":"IF(ISBLANK('3-PAPILLONS'!$C$84),\"\",'3-PAPILLONS'!$C$84)","v":""},{"$f":"IF(ISBLANK('3-PAPILLONS'!$C$86),\"\",'3-PAPILLONS'!$C$86)","v":""},{"$f":"IF(ISBLANK('3-PAPILLONS'!$D$86),\"\",'3-PAPILLONS'!$D$86)","v":""},{"$f":"IF(ISBLANK('3-PAPILLONS'!$C$80),\"\",'3-PAPILLONS'!$C$80)","v":""},{"$f":"IF(ISBLANK('3-PAPILLONS'!$C$83),\"\",'3-PAPILLONS'!$C$83)","v":""},{"$f":"VLOOKUP('compilation données pour export'!$R128,'listes valeurs'!$X$2:$AA$3450,2,FALSE)","v":"Tristan"},{"$f":"'3-PAPILLONS'!$A$21","v":"TRI"},{"$f":"VLOOKUP('compilation données pour export'!$R128,'listes valeurs'!$X$2:$AA$3450,4,FALSE)","v":"Aphantopus hyperantus"},{"$f":"VLOOKUP('compilation données pour export'!$R128,'listes valeurs'!$X$2:$AA$3450,3,FALSE)","v":"Papillons"},"Nombre individus",{"$f":"IF(ISBLANK('3-PAPILLONS'!C$93),\"\",'3-PAPILLONS'!C$93)","v":""},"in",{"$f":"'Synthese Annuelle Monitoring'!$Q$32","v":0}]
[{"$f":"'0-INFOS GENERALES A REMPLIR'!$B$4","v":2021},{"$f":"'0-INFOS GENERALES A REMPLIR'!$B$6","v":0},{"$f":"IF(ISBLANK('0-INFOS GENERALES A REMPLIR'!$E$14),\"\",'0-INFOS GENERALES A REMPLIR'!$E$14)","v":""},{"$f":"IF(ISBLANK('0-INFOS GENERALES A REMPLIR'!$A$14),\"\",'0-INFOS GENERALES A REMPLIR'!$A$14)","v":""},{"$f":"IF(ISBLANK('0-INFOS GENERALES A REMPLIR'!$D$14),\"\",'0-INFOS GENERALES A REMPLIR'!$D$14)","v":""},{"$f":"IFERROR(INDEX('listes valeurs'!F$2:F$552,MATCH(1,('listes valeurs'!B$2:B$552=B129)*('listes valeurs'!E$2:E$552=D129),0)),\"\")","v":""},null,null,null,null,{"$f":"'3-PAPILLONS'!$C$82","v":"Passage 1"},{"$f":"IF(ISBLANK('3-PAPILLONS'!$C$84),\"\",'3-PAPILLONS'!$C$84)","v":""},{"$f":"IF(ISBLANK('3-PAPILLONS'!$C$86),\"\",'3-PAPILLONS'!$C$86)","v":""},{"$f":"IF(ISBLANK('3-PAPILLONS'!$D$86),\"\",'3-PAPILLONS'!$D$86)","v":""},{"$f":"IF(ISBLANK('3-PAPILLONS'!$C$80),\"\",'3-PAPILLONS'!$C$80)","v":""},{"$f":"IF(ISBLANK('3-PAPILLONS'!$C$83),\"\",'3-PAPILLONS'!$C$83)","v":""},{"$f":"VLOOKUP('compilation données pour export'!$R129,'listes valeurs'!$X$2:$AA$3450,2,FALSE)","v":"Tristan"},{"$f":"'3-PAPILLONS'!$A$21","v":"TRI"},{"$f":"VLOOKUP('compilation données pour export'!$R129,'listes valeurs'!$X$2:$AA$3450,4,FALSE)","v":"Aphantopus hyperantus"},{"$f":"VLOOKUP('compilation données pour export'!$R129,'listes valeurs'!$X$2:$AA$3450,3,FALSE)","v":"Papillons"},"Nombre individus",{"$f":"IF(ISBLANK('3-PAPILLONS'!D$93),\"\",'3-PAPILLONS'!D$93)","v":""},"out",{"$f":"'Synthese Annuelle Monitoring'!$Q$32","v":0}]
[{"$f":"'0-INFOS GENERALES A REMPLIR'!$B$4","v":2021},{"$f":"'0-INFOS GENERALES A REMPLIR'!$B$6","v":0},{"$f":"IF(ISBLANK('0-INFOS GENERALES A REMPLIR'!$E$14),\"\",'0-INFOS GENERALES A REMPLIR'!$E$14)","v":""},{"$f":"IF(ISBLANK('0-INFOS GENERALES A REMPLIR'!$A$14),\"\",'0-INFOS GENERALES A REMPLIR'!$A$14)","v":""},{"$f":"IF(ISBLANK('0-INFOS GENERALES A REMPLIR'!$D$14),\"\",'0-INFOS GENERALES A REMPLIR'!$D$14)","v":""},{"$f":"IFERROR(INDEX('listes valeurs'!F$2:F$552,MATCH(1,('listes valeurs'!B$2:B$552=B130)*('listes valeurs'!E$2:E$552=D130),0)),\"\")","v":""},null,null,null,null,{"$f":"'3-PAPILLONS'!$F$82","v":"Passage 2"},{"$f":"IF(ISBLANK('3-PAPILLONS'!$F$84),\"\",'3-PAPILLONS'!$F$84)","v":""},{"$f":"IF(ISBLANK('3-PAPILLONS'!$F$86),\"\",'3-PAPILLONS'!$F$86)","v":""},{"$f":"IF(ISBLANK('3-PAPILLONS'!$G$86),\"\",'3-PAPILLONS'!$G$86)","v":""},{"$f":"IF(ISBLANK('3-PAPILLONS'!$C$80),\"\",'3-PAPILLONS'!$C$80)","v":""},{"$f":"IF(ISBLANK('3-PAPILLONS'!$F$83),\"\",'3-PAPILLONS'!$F$83)","v":""},{"$f":"VLOOKUP('compilation données pour export'!$R130,'listes valeurs'!$X$2:$AA$3450,2,FALSE)","v":"Tristan"},{"$f":"'3-PAPILLONS'!$A$21","v":"TRI"},{"$f":"VLOOKUP('compilation données pour export'!$R130,'listes valeurs'!$X$2:$AA$3450,4,FALSE)","v":"Aphantopus hyperantus"},{"$f":"VLOOKUP('compilation données pour export'!$R130,'listes valeurs'!$X$2:$AA$3450,3,FALSE)","v":"Papillons"},"Nombre individus",{"$f":"IF(ISBLANK('3-PAPILLONS'!F$93),\"\",'3-PAPILLONS'!F$93)","v":""},"in",{"$f":"'Synthese Annuelle Monitoring'!$Q$32","v":0}]
[{"$f":"'0-INFOS GENERALES A REMPLIR'!$B$4","v":2021},{"$f":"'0-INFOS GENERALES A REMPLIR'!$B$6","v":0},{"$f":"IF(ISBLANK('0-INFOS GENERALES A REMPLIR'!$E$14),\"\",'0-INFOS GENERALES A REMPLIR'!$E$14)","v":""},{"$f":"IF(ISBLANK('0-INFOS GENERALES A REMPLIR'!$A$14),\"\",'0-INFOS GENERALES A REMPLIR'!$A$14)","v":""},{"$f":"IF(ISBLANK('0-INFOS GENERALES A REMPLIR'!$D$14),\"\",'0-INFOS GENERALES A REMPLIR'!$D$14)","v":""},{"$f":"IFERROR(INDEX('listes valeurs'!F$2:F$552,MATCH(1,('listes valeurs'!B$2:B$552=B131)*('listes valeurs'!E$2:E$552=D131),0)),\"\")","v":""},null,null,null,null,{"$f":"'3-PAPILLONS'!$F$82","v":"Passage 2"},{"$f":"IF(ISBLANK('3-PAPILLONS'!$F$84),\"\",'3-PAPILLONS'!$F$84)","v":""},{"$f":"IF(ISBLANK('3-PAPILLONS'!$F$86),\"\",'3-PAPILLONS'!$F$86)","v":""},{"$f":"IF(ISBLANK('3-PAPILLONS'!$G$86),\"\",'3-PAPILLONS'!$G$86)","v":""},{"$f":"IF(ISBLANK('3-PAPILLONS'!$C$80),\"\",'3-PAPILLONS'!$C$80)","v":""},{"$f":"IF(ISBLANK('3-PAPILLONS'!$F$83),\"\",'3-PAPILLONS'!$F$83)","v":""},{"$f":"VLOOKUP('compilation données pour export'!$R131,'listes valeurs'!$X$2:$AA$3450,2,FALSE)","v":"Tristan"},{"$f":"'3-PAPILLONS'!$A$21","v":"TRI"},{"$f":"VLOOKUP('compilation données pour export'!$R131,'listes valeurs'!$X$2:$AA$3450,4,FALSE)","v":"Aphantopus hyperantus"},{"$f":"VLOOKUP('compilation données pour export'!$R131,'listes valeurs'!$X$2:$AA$3450,3,FALSE)","v":"Papillons"},"Nombre individus",{"$f":"IF(ISBLANK('3-PAPILLONS'!G$93),\"\",'3-PAPILLONS'!G$93)","v":""},"out",{"$f":"'Synthese Annuelle Monitoring'!$Q$32","v":0}]
[{"$f":"'0-INFOS GENERALES A REMPLIR'!$B$4","v":2021},{"$f":"'0-INFOS GENERALES A REMPLIR'!$B$6","v":0},{"$f":"IF(ISBLANK('0-INFOS GENERALES A REMPLIR'!$E$15),\"\",'0-INFOS GENERALES A REMPLIR'!$E$15)","v":""},{"$f":"IF(ISBLANK('0-INFOS GENERALES A REMPLIR'!$A$15),\"\",'0-INFOS GENERALES A REMPLIR'!$A$15)","v":""},{"$f":"IF(ISBLANK('0-INFOS GENERALES A REMPLIR'!$D$15),\"\",'0-INFOS GENERALES A REMPLIR'!$D$15)","v":""},{"$f":"IFERROR(INDEX('listes valeurs'!F$2:F$552,MATCH(1,('listes valeurs'!B$2:B$552=B132)*('listes valeurs'!E$2:E$552=D132),0)),\"\")","v":""},null,null,null,null,{"$f":"'3-PAPILLONS'!$C$118","v":"Passage 1"},{"$f":"IF(ISBLANK('3-PAPILLONS'!$C$120),\"\",'3-PAPILLONS'!$C$120)","v":""},{"$f":"IF(ISBLANK('3-PAPILLONS'!$C$122),\"\",'3-PAPILLONS'!$C$122)","v":""},{"$f":"IF(ISBLANK('3-PAPILLONS'!$D$122),\"\",'3-PAPILLONS'!$D$122)","v":""},{"$f":"IF(ISBLANK('3-PAPILLONS'!$C$116),\"\",'3-PAPILLONS'!$C$116)","v":""},{"$f":"IF(ISBLANK('3-PAPILLONS'!$C$119),\"\",'3-PAPILLONS'!$C$119)","v":""},{"$f":"VLOOKUP('compilation données pour export'!$R132,'listes valeurs'!$X$2:$AA$3450,2,FALSE)","v":"Tristan"},{"$f":"'3-PAPILLONS'!$A$21","v":"TRI"},{"$f":"VLOOKUP('compilation données pour export'!$R132,'listes valeurs'!$X$2:$AA$3450,4,FALSE)","v":"Aphantopus hyperantus"},{"$f":"VLOOKUP('compilation données pour export'!$R132,'listes valeurs'!$X$2:$AA$3450,3,FALSE)","v":"Papillons"},"Nombre individus",{"$f":"IF(ISBLANK('3-PAPILLONS'!C$129),\"\",'3-PAPILLONS'!C$129)","v":""},"in",{"$f":"'Synthese Annuelle Monitoring'!$Q$32","v":0}]
[{"$f":"'0-INFOS GENERALES A REMPLIR'!$B$4","v":2021},{"$f":"'0-INFOS GENERALES A REMPLIR'!$B$6","v":0},{"$f":"IF(ISBLANK('0-INFOS GENERALES A REMPLIR'!$E$15),\"\",'0-INFOS GENERALES A REMPLIR'!$E$15)","v":""},{"$f":"IF(ISBLANK('0-INFOS GENERALES A REMPLIR'!$A$15),\"\",'0-INFOS GENERALES A REMPLIR'!$A$15)","v":""},{"$f":"IF(ISBLANK('0-INFOS GENERALES A REMPLIR'!$D$15),\"\",'0-INFOS GENERALES A REMPLIR'!$D$15)","v":""},{"$f":"IFERROR(INDEX('listes valeurs'!F$2:F$552,MATCH(1,('listes valeurs'!B$2:B$552=B133)*('listes valeurs'!E$2:E$552=D133),0)),\"\")","v":""},null,null,null,null,{"$f":"'3-PAPILLONS'!$C$118","v":"Passage 1"},{"$f":"IF(ISBLANK('3-PAPILLONS'!$C$120),\"\",'3-PAPILLONS'!$C$120)","v":""},{"$f":"IF(ISBLANK('3-PAPILLONS'!$C$122),\"\",'3-PAPILLONS'!$C$122)","v":""},{"$f":"IF(ISBLANK('3-PAPILLONS'!$D$122),\"\",'3-PAPILLONS'!$D$122)","v":""},{"$f":"IF(ISBLANK('3-PAPILLONS'!$C$116),\"\",'3-PAPILLONS'!$C$116)","v":""},{"$f":"IF(ISBLANK('3-PAPILLONS'!$C$119),\"\",'3-PAPILLONS'!$C$119)","v":""},{"$f":"VLOOKUP('compilation données pour export'!$R133,'listes valeurs'!$X$2:$AA$3450,2,FALSE)","v":"Tristan"},{"$f":"'3-PAPILLONS'!$A$21","v":"TRI"},{"$f":"VLOOKUP('compilation données pour export'!$R133,'listes valeurs'!$X$2:$AA$3450,4,FALSE)","v":"Aphantopus hyperantus"},{"$f":"VLOOKUP('compilation données pour export'!$R133,'listes valeurs'!$X$2:$AA$3450,3,FALSE)","v":"Papillons"},"Nombre individus",{"$f":"IF(ISBLANK('3-PAPILLONS'!D$129),\"\",'3-PAPILLONS'!D$129)","v":""},"out",{"$f":"'Synthese Annuelle Monitoring'!$Q$32","v":0}]
[{"$f":"'0-INFOS GENERALES A REMPLIR'!$B$4","v":2021},{"$f":"'0-INFOS GENERALES A REMPLIR'!$B$6","v":0},{"$f":"IF(ISBLANK('0-INFOS GENERALES A REMPLIR'!$E$15),\"\",'0-INFOS GENERALES A REMPLIR'!$E$15)","v":""},{"$f":"IF(ISBLANK('0-INFOS GENERALES A REMPLIR'!$A$15),\"\",'0-INFOS GENERALES A REMPLIR'!$A$15)","v":""},{"$f":"IF(ISBLANK('0-INFOS GENERALES A REMPLIR'!$D$15),\"\",'0-INFOS GENERALES A REMPLIR'!$D$15)","v":""},{"$f":"IFERROR(INDEX('listes valeurs'!F$2:F$552,MATCH(1,('listes valeurs'!B$2:B$552=B134)*('listes valeurs'!E$2:E$552=D134),0)),\"\")","v":""},null,null,null,null,{"$f":"'3-PAPILLONS'!$F$118","v":"Passage 2"},{"$f":"IF(ISBLANK('3-PAPILLONS'!$F$120),\"\",'3-PAPILLONS'!$F$120)","v":""},{"$f":"IF(ISBLANK('3-PAPILLONS'!$F$122),\"\",'3-PAPILLONS'!$F$122)","v":""},{"$f":"IF(ISBLANK('3-PAPILLONS'!$G$122),\"\",'3-PAPILLONS'!$G$122)","v":""},{"$f":"IF(ISBLANK('3-PAPILLONS'!$C$116),\"\",'3-PAPILLONS'!$C$116)","v":""},{"$f":"IF(ISBLANK('3-PAPILLONS'!$F$119),\"\",'3-PAPILLONS'!$F$119)","v":""},{"$f":"VLOOKUP('compilation données pour export'!$R134,'listes valeurs'!$X$2:$AA$3450,2,FALSE)","v":"Tristan"},{"$f":"'3-PAPILLONS'!$A$21","v":"TRI"},{"$f":"VLOOKUP('compilation données pour export'!$R134,'listes valeurs'!$X$2:$AA$3450,4,FALSE)","v":"Aphantopus hyperantus"},{"$f":"VLOOKUP('compilation données pour export'!$R134,'listes valeurs'!$X$2:$AA$3450,3,FALSE)","v":"Papillons"},"Nombre individus",{"$f":"IF(ISBLANK('3-PAPILLONS'!F$129),\"\",'3-PAPILLONS'!F$129)","v":""},"in",{"$f":"'Synthese Annuelle Monitoring'!$Q$32","v":0}]
[{"$f":"'0-INFOS GENERALES A REMPLIR'!$B$4","v":2021},{"$f":"'0-INFOS GENERALES A REMPLIR'!$B$6","v":0},{"$f":"IF(ISBLANK('0-INFOS GENERALES A REMPLIR'!$E$15),\"\",'0-INFOS GENERALES A REMPLIR'!$E$15)","v":""},{"$f":"IF(ISBLANK('0-INFOS GENERALES A REMPLIR'!$A$15),\"\",'0-INFOS GENERALES A REMPLIR'!$A$15)","v":""},{"$f":"IF(ISBLANK('0-INFOS GENERALES A REMPLIR'!$D$15),\"\",'0-INFOS GENERALES A REMPLIR'!$D$15)","v":""},{"$f":"IFERROR(INDEX('listes valeurs'!F$2:F$552,MATCH(1,('listes valeurs'!B$2:B$552=B135)*('listes valeurs'!E$2:E$552=D135),0)),\"\")","v":""},null,null,null,null,{"$f":"'3-PAPILLONS'!$F$118","v":"Passage 2"},{"$f":"IF(ISBLANK('3-PAPILLONS'!$F$120),\"\",'3-PAPILLONS'!$F$120)","v":""},{"$f":"IF(ISBLANK('3-PAPILLONS'!$F$122),\"\",'3-PAPILLONS'!$F$122)","v":""},{"$f":"IF(ISBLANK('3-PAPILLONS'!$G$122),\"\",'3-PAPILLONS'!$G$122)","v":""},{"$f":"IF(ISBLANK('3-PAPILLONS'!$C$116),\"\",'3-PAPILLONS'!$C$116)","v":""},{"$f":"IF(ISBLANK('3-PAPILLONS'!$F$119),\"\",'3-PAPILLONS'!$F$119)","v":""},{"$f":"VLOOKUP('compilation données pour export'!$R135,'listes valeurs'!$X$2:$AA$3450,2,FALSE)","v":"Tristan"},{"$f":"'3-PAPILLONS'!$A$21","v":"TRI"},{"$f":"VLOOKUP('compilation données pour export'!$R135,'listes valeurs'!$X$2:$AA$3450,4,FALSE)","v":"Aphantopus hyperantus"},{"$f":"VLOOKUP('compilation données pour export'!$R135,'listes valeurs'!$X$2:$AA$3450,3,FALSE)","v":"Papillons"},"Nombre individus",{"$f":"IF(ISBLANK('3-PAPILLONS'!G$129),\"\",'3-PAPILLONS'!G$129)","v":""},"out",{"$f":"'Synthese Annuelle Monitoring'!$Q$32","v":0}]
[{"$f":"'0-INFOS GENERALES A REMPLIR'!$B$4","v":2021},{"$f":"'0-INFOS GENERALES A REMPLIR'!$B$6","v":0},{"$f":"IF(ISBLANK('0-INFOS GENERALES A REMPLIR'!$E$16),\"\",'0-INFOS GENERALES A REMPLIR'!$E$16)","v":""},{"$f":"IF(ISBLANK('0-INFOS GENERALES A REMPLIR'!$A$16),\"\",'0-INFOS GENERALES A REMPLIR'!$A$16)","v":""},{"$f":"IF(ISBLANK('0-INFOS GENERALES A REMPLIR'!$D$16),\"\",'0-INFOS GENERALES A REMPLIR'!$D$16)","v":""},{"$f":"IFERROR(INDEX('listes valeurs'!F$2:F$552,MATCH(1,('listes valeurs'!B$2:B$552=B136)*('listes valeurs'!E$2:E$552=D136),0)),\"\")","v":""},null,null,null,null,{"$f":"'3-PAPILLONS'!$C$154","v":"Passage 1"},{"$f":"IF(ISBLANK('3-PAPILLONS'!$C$156),\"\",'3-PAPILLONS'!$C$156)","v":""},{"$f":"IF(ISBLANK('3-PAPILLONS'!$C$158),\"\",'3-PAPILLONS'!$C$158)","v":""},{"$f":"IF(ISBLANK('3-PAPILLONS'!$D$158),\"\",'3-PAPILLONS'!$D$158)","v":""},{"$f":"IF(ISBLANK('3-PAPILLONS'!$C$152),\"\",'3-PAPILLONS'!$C$152)","v":""},{"$f":"IF(ISBLANK('3-PAPILLONS'!$C$155),\"\",'3-PAPILLONS'!$C$155)","v":""},{"$f":"VLOOKUP('compilation données pour export'!$R136,'listes valeurs'!$X$2:$AA$3450,2,FALSE)","v":"Tristan"},{"$f":"'3-PAPILLONS'!$A$21","v":"TRI"},{"$f":"VLOOKUP('compilation données pour export'!$R136,'listes valeurs'!$X$2:$AA$3450,4,FALSE)","v":"Aphantopus hyperantus"},{"$f":"VLOOKUP('compilation données pour export'!$R136,'listes valeurs'!$X$2:$AA$3450,3,FALSE)","v":"Papillons"},"Nombre individus",{"$f":"IF(ISBLANK('3-PAPILLONS'!C$165),\"\",'3-PAPILLONS'!C$165)","v":""},"in",{"$f":"'Synthese Annuelle Monitoring'!$Q$32","v":0}]
[{"$f":"'0-INFOS GENERALES A REMPLIR'!$B$4","v":2021},{"$f":"'0-INFOS GENERALES A REMPLIR'!$B$6","v":0},{"$f":"IF(ISBLANK('0-INFOS GENERALES A REMPLIR'!$E$16),\"\",'0-INFOS GENERALES A REMPLIR'!$E$16)","v":""},{"$f":"IF(ISBLANK('0-INFOS GENERALES A REMPLIR'!$A$16),\"\",'0-INFOS GENERALES A REMPLIR'!$A$16)","v":""},{"$f":"IF(ISBLANK('0-INFOS GENERALES A REMPLIR'!$D$16),\"\",'0-INFOS GENERALES A REMPLIR'!$D$16)","v":""},{"$f":"IFERROR(INDEX('listes valeurs'!F$2:F$552,MATCH(1,('listes valeurs'!B$2:B$552=B137)*('listes valeurs'!E$2:E$552=D137),0)),\"\")","v":""},null,null,null,null,{"$f":"'3-PAPILLONS'!$C$154","v":"Passage 1"},{"$f":"IF(ISBLANK('3-PAPILLONS'!$C$156),\"\",'3-PAPILLONS'!$C$156)","v":""},{"$f":"IF(ISBLANK('3-PAPILLONS'!$C$158),\"\",'3-PAPILLONS'!$C$158)","v":""},{"$f":"IF(ISBLANK('3-PAPILLONS'!$D$158),\"\",'3-PAPILLONS'!$D$158)","v":""},{"$f":"IF(ISBLANK('3-PAPILLONS'!$C$152),\"\",'3-PAPILLONS'!$C$152)","v":""},{"$f":"IF(ISBLANK('3-PAPILLONS'!$C$155),\"\",'3-PAPILLONS'!$C$155)","v":""},{"$f":"VLOOKUP('compilation données pour export'!$R137,'listes valeurs'!$X$2:$AA$3450,2,FALSE)","v":"Tristan"},{"$f":"'3-PAPILLONS'!$A$21","v":"TRI"},{"$f":"VLOOKUP('compilation données pour export'!$R137,'listes valeurs'!$X$2:$AA$3450,4,FALSE)","v":"Aphantopus hyperantus"},{"$f":"VLOOKUP('compilation données pour export'!$R137,'listes valeurs'!$X$2:$AA$3450,3,FALSE)","v":"Papillons"},"Nombre individus",{"$f":"IF(ISBLANK('3-PAPILLONS'!D$165),\"\",'3-PAPILLONS'!D$165)","v":""},"out",{"$f":"'Synthese Annuelle Monitoring'!$Q$32","v":0}]
[{"$f":"'0-INFOS GENERALES A REMPLIR'!$B$4","v":2021},{"$f":"'0-INFOS GENERALES A REMPLIR'!$B$6","v":0},{"$f":"IF(ISBLANK('0-INFOS GENERALES A REMPLIR'!$E$16),\"\",'0-INFOS GENERALES A REMPLIR'!$E$16)","v":""},{"$f":"IF(ISBLANK('0-INFOS GENERALES A REMPLIR'!$A$16),\"\",'0-INFOS GENERALES A REMPLIR'!$A$16)","v":""},{"$f":"IF(ISBLANK('0-INFOS GENERALES A REMPLIR'!$D$16),\"\",'0-INFOS GENERALES A REMPLIR'!$D$16)","v":""},{"$f":"IFERROR(INDEX('listes valeurs'!F$2:F$552,MATCH(1,('listes valeurs'!B$2:B$552=B138)*('listes valeurs'!E$2:E$552=D138),0)),\"\")","v":""},null,null,null,null,{"$f":"'3-PAPILLONS'!$F$154","v":"Passage 2"},{"$f":"IF(ISBLANK('3-PAPILLONS'!$F$156),\"\",'3-PAPILLONS'!$F$156)","v":""},{"$f":"IF(ISBLANK('3-PAPILLONS'!$F$158),\"\",'3-PAPILLONS'!$F$158)","v":""},{"$f":"IF(ISBLANK('3-PAPILLONS'!$G$158),\"\",'3-PAPILLONS'!$G$158)","v":""},{"$f":"IF(ISBLANK('3-PAPILLONS'!$C$152),\"\",'3-PAPILLONS'!$C$152)","v":""},{"$f":"IF(ISBLANK('3-PAPILLONS'!$F$155),\"\",'3-PAPILLONS'!$F$155)","v":""},{"$f":"VLOOKUP('compilation données pour export'!$R138,'listes valeurs'!$X$2:$AA$3450,2,FALSE)","v":"Tristan"},{"$f":"'3-PAPILLONS'!$A$21","v":"TRI"},{"$f":"VLOOKUP('compilation données pour export'!$R138,'listes valeurs'!$X$2:$AA$3450,4,FALSE)","v":"Aphantopus hyperantus"},{"$f":"VLOOKUP('compilation données pour export'!$R138,'listes valeurs'!$X$2:$AA$3450,3,FALSE)","v":"Papillons"},"Nombre individus",{"$f":"IF(ISBLANK('3-PAPILLONS'!F$165),\"\",'3-PAPILLONS'!F$165)","v":""},"in",{"$f":"'Synthese Annuelle Monitoring'!$Q$32","v":0}]
[{"$f":"'0-INFOS GENERALES A REMPLIR'!$B$4","v":2021},{"$f":"'0-INFOS GENERALES A REMPLIR'!$B$6","v":0},{"$f":"IF(ISBLANK('0-INFOS GENERALES A REMPLIR'!$E$16),\"\",'0-INFOS GENERALES A REMPLIR'!$E$16)","v":""},{"$f":"IF(ISBLANK('0-INFOS GENERALES A REMPLIR'!$A$16),\"\",'0-INFOS GENERALES A REMPLIR'!$A$16)","v":""},{"$f":"IF(ISBLANK('0-INFOS GENERALES A REMPLIR'!$D$16),\"\",'0-INFOS GENERALES A REMPLIR'!$D$16)","v":""},{"$f":"IFERROR(INDEX('listes valeurs'!F$2:F$552,MATCH(1,('listes valeurs'!B$2:B$552=B139)*('listes valeurs'!E$2:E$552=D139),0)),\"\")","v":""},null,null,null,null,{"$f":"'3-PAPILLONS'!$F$154","v":"Passage 2"},{"$f":"IF(ISBLANK('3-PAPILLONS'!$F$156),\"\",'3-PAPILLONS'!$F$156)","v":""},{"$f":"IF(ISBLANK('3-PAPILLONS'!$F$158),\"\",'3-PAPILLONS'!$F$158)","v":""},{"$f":"IF(ISBLANK('3-PAPILLONS'!$G$158),\"\",'3-PAPILLONS'!$G$158)","v":""},{"$f":"IF(ISBLANK('3-PAPILLONS'!$C$152),\"\",'3-PAPILLONS'!$C$152)","v":""},{"$f":"IF(ISBLANK('3-PAPILLONS'!$F$155),\"\",'3-PAPILLONS'!$F$155)","v":""},{"$f":"VLOOKUP('compilation données pour export'!$R139,'listes valeurs'!$X$2:$AA$3450,2,FALSE)","v":"Tristan"},{"$f":"'3-PAPILLONS'!$A$21","v":"TRI"},{"$f":"VLOOKUP('compilation données pour export'!$R139,'listes valeurs'!$X$2:$AA$3450,4,FALSE)","v":"Aphantopus hyperantus"},{"$f":"VLOOKUP('compilation données pour export'!$R139,'listes valeurs'!$X$2:$AA$3450,3,FALSE)","v":"Papillons"},"Nombre individus",{"$f":"IF(ISBLANK('3-PAPILLONS'!G$165),\"\",'3-PAPILLONS'!G$165)","v":""},"out",{"$f":"'Synthese Annuelle Monitoring'!$Q$32","v":0}]
[{"$f":"'0-INFOS GENERALES A REMPLIR'!$B$4","v":2021},{"$f":"'0-INFOS GENERALES A REMPLIR'!$B$6","v":0},{"$f":"IF(ISBLANK('0-INFOS GENERALES A REMPLIR'!$E$12),\"\",'0-INFOS GENERALES A REMPLIR'!$E$12)","v":""},{"$f":"IF(ISBLANK('0-INFOS GENERALES A REMPLIR'!$A$12),\"\",'0-INFOS GENERALES A REMPLIR'!$A$12)","v":""},{"$f":"IF(ISBLANK('0-INFOS GENERALES A REMPLIR'!$D$12),\"\",'0-INFOS GENERALES A REMPLIR'!$D$12)","v":""},{"$f":"IFERROR(INDEX('listes valeurs'!F$2:F$552,MATCH(1,('listes valeurs'!B$2:B$552=B140)*('listes valeurs'!E$2:E$552=D140),0)),\"\")","v":""},null,null,null,null,{"$f":"'3-PAPILLONS'!$C$10","v":"Passage 1"},{"$f":"IF(ISBLANK('3-PAPILLONS'!$C$12),\"\",'3-PAPILLONS'!$C$12)","v":""},{"$f":"IF(ISBLANK('3-PAPILLONS'!$C$14),\"\",'3-PAPILLONS'!$C$14)","v":""},{"$f":"IF(ISBLANK('3-PAPILLONS'!$D$14),\"\",'3-PAPILLONS'!$D$14)","v":""},{"$f":"IF(ISBLANK('3-PAPILLONS'!$C$8),\"\",'3-PAPILLONS'!$C$8)","v":""},{"$f":"IF(ISBLANK('3-PAPILLONS'!$C$11),\"\",'3-PAPILLONS'!$C$11)","v":""},{"$f":"VLOOKUP('compilation données pour export'!$R140,'listes valeurs'!$X$2:$AA$3450,2,FALSE)","v":"Nacré de la sanguisorbe"},{"$f":"'3-PAPILLONS'!$A$22","v":"NAC"},{"$f":"VLOOKUP('compilation données pour export'!$R140,'listes valeurs'!$X$2:$AA$3450,4,FALSE)","v":"Brenthis ino"},{"$f":"VLOOKUP('compilation données pour export'!$R140,'listes valeurs'!$X$2:$AA$3450,3,FALSE)","v":"Papillons"},"Nombre individus",{"$f":"IF(ISBLANK('3-PAPILLONS'!C$22),\"\",'3-PAPILLONS'!C$22)","v":""},"in",{"$f":"'Synthese Annuelle Monitoring'!$Q$33","v":0}]
[{"$f":"'0-INFOS GENERALES A REMPLIR'!$B$4","v":2021},{"$f":"'0-INFOS GENERALES A REMPLIR'!$B$6","v":0},{"$f":"IF(ISBLANK('0-INFOS GENERALES A REMPLIR'!$E$12),\"\",'0-INFOS GENERALES A REMPLIR'!$E$12)","v":""},{"$f":"IF(ISBLANK('0-INFOS GENERALES A REMPLIR'!$A$12),\"\",'0-INFOS GENERALES A REMPLIR'!$A$12)","v":""},{"$f":"IF(ISBLANK('0-INFOS GENERALES A REMPLIR'!$D$12),\"\",'0-INFOS GENERALES A REMPLIR'!$D$12)","v":""},{"$f":"IFERROR(INDEX('listes valeurs'!F$2:F$552,MATCH(1,('listes valeurs'!B$2:B$552=B141)*('listes valeurs'!E$2:E$552=D141),0)),\"\")","v":""},null,null,null,null,{"$f":"'3-PAPILLONS'!$C$10","v":"Passage 1"},{"$f":"IF(ISBLANK('3-PAPILLONS'!$C$12),\"\",'3-PAPILLONS'!$C$12)","v":""},{"$f":"IF(ISBLANK('3-PAPILLONS'!$C$14),\"\",'3-PAPILLONS'!$C$14)","v":""},{"$f":"IF(ISBLANK('3-PAPILLONS'!$D$14),\"\",'3-PAPILLONS'!$D$14)","v":""},{"$f":"IF(ISBLANK('3-PAPILLONS'!$C$8),\"\",'3-PAPILLONS'!$C$8)","v":""},{"$f":"IF(ISBLANK('3-PAPILLONS'!$C$11),\"\",'3-PAPILLONS'!$C$11)","v":""},{"$f":"VLOOKUP('compilation données pour export'!$R141,'listes valeurs'!$X$2:$AA$3450,2,FALSE)","v":"Nacré de la sanguisorbe"},{"$f":"'3-PAPILLONS'!$A$22","v":"NAC"},{"$f":"VLOOKUP('compilation données pour export'!$R141,'listes valeurs'!$X$2:$AA$3450,4,FALSE)","v":"Brenthis ino"},{"$f":"VLOOKUP('compilation données pour export'!$R141,'listes valeurs'!$X$2:$AA$3450,3,FALSE)","v":"Papillons"},"Nombre individus",{"$f":"IF(ISBLANK('3-PAPILLONS'!D$22),\"\",'3-PAPILLONS'!D$22)","v":""},"out",{"$f":"'Synthese Annuelle Monitoring'!$Q$33","v":0}]
[{"$f":"'0-INFOS GENERALES A REMPLIR'!$B$4","v":2021},{"$f":"'0-INFOS GENERALES A REMPLIR'!$B$6","v":0},{"$f":"IF(ISBLANK('0-INFOS GENERALES A REMPLIR'!$E$12),\"\",'0-INFOS GENERALES A REMPLIR'!$E$12)","v":""},{"$f":"IF(ISBLANK('0-INFOS GENERALES A REMPLIR'!$A$12),\"\",'0-INFOS GENERALES A REMPLIR'!$A$12)","v":""},{"$f":"IF(ISBLANK('0-INFOS GENERALES A REMPLIR'!$D$12),\"\",'0-INFOS GENERALES A REMPLIR'!$D$12)","v":""},{"$f":"IFERROR(INDEX('listes valeurs'!F$2:F$552,MATCH(1,('listes valeurs'!B$2:B$552=B142)*('listes valeurs'!E$2:E$552=D142),0)),\"\")","v":""},null,null,null,null,{"$f":"'3-PAPILLONS'!$F$10","v":"Passage 2"},{"$f":"IF(ISBLANK('3-PAPILLONS'!$F$12),\"\",'3-PAPILLONS'!$F$12)","v":""},{"$f":"IF(ISBLANK('3-PAPILLONS'!$F$14),\"\",'3-PAPILLONS'!$F$14)","v":""},{"$f":"IF(ISBLANK('3-PAPILLONS'!$G$14),\"\",'3-PAPILLONS'!$G$14)","v":""},{"$f":"IF(ISBLANK('3-PAPILLONS'!$C$8),\"\",'3-PAPILLONS'!$C$8)","v":""},{"$f":"IF(ISBLANK('3-PAPILLONS'!$F$11),\"\",'3-PAPILLONS'!$F$11)","v":""},{"$f":"VLOOKUP('compilation données pour export'!$R142,'listes valeurs'!$X$2:$AA$3450,2,FALSE)","v":"Nacré de la sanguisorbe"},{"$f":"'3-PAPILLONS'!$A$22","v":"NAC"},{"$f":"VLOOKUP('compilation données pour export'!$R142,'listes valeurs'!$X$2:$AA$3450,4,FALSE)","v":"Brenthis ino"},{"$f":"VLOOKUP('compilation données pour export'!$R142,'listes valeurs'!$X$2:$AA$3450,3,FALSE)","v":"Papillons"},"Nombre individus",{"$f":"IF(ISBLANK('3-PAPILLONS'!F$22),\"\",'3-PAPILLONS'!F$22)","v":""},"in",{"$f":"'Synthese Annuelle Monitoring'!$Q$33","v":0}]
[{"$f":"'0-INFOS GENERALES A REMPLIR'!$B$4","v":2021},{"$f":"'0-INFOS GENERALES A REMPLIR'!$B$6","v":0},{"$f":"IF(ISBLANK('0-INFOS GENERALES A REMPLIR'!$E$12),\"\",'0-INFOS GENERALES A REMPLIR'!$E$12)","v":""},{"$f":"IF(ISBLANK('0-INFOS GENERALES A REMPLIR'!$A$12),\"\",'0-INFOS GENERALES A REMPLIR'!$A$12)","v":""},{"$f":"IF(ISBLANK('0-INFOS GENERALES A REMPLIR'!$D$12),\"\",'0-INFOS GENERALES A REMPLIR'!$D$12)","v":""},{"$f":"IFERROR(INDEX('listes valeurs'!F$2:F$552,MATCH(1,('listes valeurs'!B$2:B$552=B143)*('listes valeurs'!E$2:E$552=D143),0)),\"\")","v":""},null,null,null,null,{"$f":"'3-PAPILLONS'!$F$10","v":"Passage 2"},{"$f":"IF(ISBLANK('3-PAPILLONS'!$F$12),\"\",'3-PAPILLONS'!$F$12)","v":""},{"$f":"IF(ISBLANK('3-PAPILLONS'!$F$14),\"\",'3-PAPILLONS'!$F$14)","v":""},{"$f":"IF(ISBLANK('3-PAPILLONS'!$G$14),\"\",'3-PAPILLONS'!$G$14)","v":""},{"$f":"IF(ISBLANK('3-PAPILLONS'!$C$8),\"\",'3-PAPILLONS'!$C$8)","v":""},{"$f":"IF(ISBLANK('3-PAPILLONS'!$F$11),\"\",'3-PAPILLONS'!$F$11)","v":""},{"$f":"VLOOKUP('compilation données pour export'!$R143,'listes valeurs'!$X$2:$AA$3450,2,FALSE)","v":"Nacré de la sanguisorbe"},{"$f":"'3-PAPILLONS'!$A$22","v":"NAC"},{"$f":"VLOOKUP('compilation données pour export'!$R143,'listes valeurs'!$X$2:$AA$3450,4,FALSE)","v":"Brenthis ino"},{"$f":"VLOOKUP('compilation données pour export'!$R143,'listes valeurs'!$X$2:$AA$3450,3,FALSE)","v":"Papillons"},"Nombre individus",{"$f":"IF(ISBLANK('3-PAPILLONS'!G$22),\"\",'3-PAPILLONS'!G$22)","v":""},"out",{"$f":"'Synthese Annuelle Monitoring'!$Q$33","v":0}]
[{"$f":"'0-INFOS GENERALES A REMPLIR'!$B$4","v":2021},{"$f":"'0-INFOS GENERALES A REMPLIR'!$B$6","v":0},{"$f":"IF(ISBLANK('0-INFOS GENERALES A REMPLIR'!$E$13),\"\",'0-INFOS GENERALES A REMPLIR'!$E$13)","v":""},{"$f":"IF(ISBLANK('0-INFOS GENERALES A REMPLIR'!$A$13),\"\",'0-INFOS GENERALES A REMPLIR'!$A$13)","v":""},{"$f":"IF(ISBLANK('0-INFOS GENERALES A REMPLIR'!$D$13),\"\",'0-INFOS GENERALES A REMPLIR'!$D$13)","v":""},{"$f":"IFERROR(INDEX('listes valeurs'!F$2:F$552,MATCH(1,('listes valeurs'!B$2:B$552=B144)*('listes valeurs'!E$2:E$552=D144),0)),\"\")","v":""},null,null,null,null,{"$f":"'3-PAPILLONS'!$C$46","v":"Passage 1"},{"$f":"IF(ISBLANK('3-PAPILLONS'!$C$48),\"\",'3-PAPILLONS'!$C$48)","v":""},{"$f":"IF(ISBLANK('3-PAPILLONS'!$C$50),\"\",'3-PAPILLONS'!$C$50)","v":""},{"$f":"IF(ISBLANK('3-PAPILLONS'!$D$50),\"\",'3-PAPILLONS'!$D$50)","v":""},{"$f":"IF(ISBLANK('3-PAPILLONS'!$C$44),\"\",'3-PAPILLONS'!$C$44)","v":""},{"$f":"IF(ISBLANK('3-PAPILLONS'!$C$47),\"\",'3-PAPILLONS'!$C$47)","v":""},{"$f":"VLOOKUP('compilation données pour export'!$R144,'listes valeurs'!$X$2:$AA$3450,2,FALSE)","v":"Nacré de la sanguisorbe"},{"$f":"'3-PAPILLONS'!$A$22","v":"NAC"},{"$f":"VLOOKUP('compilation données pour export'!$R144,'listes valeurs'!$X$2:$AA$3450,4,FALSE)","v":"Brenthis ino"},{"$f":"VLOOKUP('compilation données pour export'!$R144,'listes valeurs'!$X$2:$AA$3450,3,FALSE)","v":"Papillons"},"Nombre individus",{"$f":"IF(ISBLANK('3-PAPILLONS'!C$58),\"\",'3-PAPILLONS'!C$58)","v":""},"in",{"$f":"'Synthese Annuelle Monitoring'!$Q$33","v":0}]
[{"$f":"'0-INFOS GENERALES A REMPLIR'!$B$4","v":2021},{"$f":"'0-INFOS GENERALES A REMPLIR'!$B$6","v":0},{"$f":"IF(ISBLANK('0-INFOS GENERALES A REMPLIR'!$E$13),\"\",'0-INFOS GENERALES A REMPLIR'!$E$13)","v":""},{"$f":"IF(ISBLANK('0-INFOS GENERALES A REMPLIR'!$A$13),\"\",'0-INFOS GENERALES A REMPLIR'!$A$13)","v":""},{"$f":"IF(ISBLANK('0-INFOS GENERALES A REMPLIR'!$D$13),\"\",'0-INFOS GENERALES A REMPLIR'!$D$13)","v":""},{"$f":"IFERROR(INDEX('listes valeurs'!F$2:F$552,MATCH(1,('listes valeurs'!B$2:B$552=B145)*('listes valeurs'!E$2:E$552=D145),0)),\"\")","v":""},null,null,null,null,{"$f":"'3-PAPILLONS'!$C$46","v":"Passage 1"},{"$f":"IF(ISBLANK('3-PAPILLONS'!$C$48),\"\",'3-PAPILLONS'!$C$48)","v":""},{"$f":"IF(ISBLANK('3-PAPILLONS'!$C$50),\"\",'3-PAPILLONS'!$C$50)","v":""},{"$f":"IF(ISBLANK('3-PAPILLONS'!$D$50),\"\",'3-PAPILLONS'!$D$50)","v":""},{"$f":"IF(ISBLANK('3-PAPILLONS'!$C$44),\"\",'3-PAPILLONS'!$C$44)","v":""},{"$f":"IF(ISBLANK('3-PAPILLONS'!$C$47),\"\",'3-PAPILLONS'!$C$47)","v":""},{"$f":"VLOOKUP('compilation données pour export'!$R145,'listes valeurs'!$X$2:$AA$3450,2,FALSE)","v":"Nacré de la sanguisorbe"},{"$f":"'3-PAPILLONS'!$A$22","v":"NAC"},{"$f":"VLOOKUP('compilation données pour export'!$R145,'listes valeurs'!$X$2:$AA$3450,4,FALSE)","v":"Brenthis ino"},{"$f":"VLOOKUP('compilation données pour export'!$R145,'listes valeurs'!$X$2:$AA$3450,3,FALSE)","v":"Papillons"},"Nombre individus",{"$f":"IF(ISBLANK('3-PAPILLONS'!D$58),\"\",'3-PAPILLONS'!D$58)","v":""},"out",{"$f":"'Synthese Annuelle Monitoring'!$Q$33","v":0}]
[{"$f":"'0-INFOS GENERALES A REMPLIR'!$B$4","v":2021},{"$f":"'0-INFOS GENERALES A REMPLIR'!$B$6","v":0},{"$f":"IF(ISBLANK('0-INFOS GENERALES A REMPLIR'!$E$13),\"\",'0-INFOS GENERALES A REMPLIR'!$E$13)","v":""},{"$f":"IF(ISBLANK('0-INFOS GENERALES A REMPLIR'!$A$13),\"\",'0-INFOS GENERALES A REMPLIR'!$A$13)","v":""},{"$f":"IF(ISBLANK('0-INFOS GENERALES A REMPLIR'!$D$13),\"\",'0-INFOS GENERALES A REMPLIR'!$D$13)","v":""},{"$f":"IFERROR(INDEX('listes valeurs'!F$2:F$552,MATCH(1,('listes valeurs'!B$2:B$552=B146)*('listes valeurs'!E$2:E$552=D146),0)),\"\")","v":""},null,null,null,null,{"$f":"'3-PAPILLONS'!$F$46","v":"Passage 2"},{"$f":"IF(ISBLANK('3-PAPILLONS'!$F$48),\"\",'3-PAPILLONS'!$F$48)","v":""},{"$f":"IF(ISBLANK('3-PAPILLONS'!$F$50),\"\",'3-PAPILLONS'!$F$50)","v":""},{"$f":"IF(ISBLANK('3-PAPILLONS'!$G$50),\"\",'3-PAPILLONS'!$G$50)","v":""},{"$f":"IF(ISBLANK('3-PAPILLONS'!$C$44),\"\",'3-PAPILLONS'!$C$44)","v":""},{"$f":"IF(ISBLANK('3-PAPILLONS'!$F$47),\"\",'3-PAPILLONS'!$F$47)","v":""},{"$f":"VLOOKUP('compilation données pour export'!$R146,'listes valeurs'!$X$2:$AA$3450,2,FALSE)","v":"Nacré de la sanguisorbe"},{"$f":"'3-PAPILLONS'!$A$22","v":"NAC"},{"$f":"VLOOKUP('compilation données pour export'!$R146,'listes valeurs'!$X$2:$AA$3450,4,FALSE)","v":"Brenthis ino"},{"$f":"VLOOKUP('compilation données pour export'!$R146,'listes valeurs'!$X$2:$AA$3450,3,FALSE)","v":"Papillons"},"Nombre individus",{"$f":"IF(ISBLANK('3-PAPILLONS'!F$58),\"\",'3-PAPILLONS'!F$58)","v":""},"in",{"$f":"'Synthese Annuelle Monitoring'!$Q$33","v":0}]
[{"$f":"'0-INFOS GENERALES A REMPLIR'!$B$4","v":2021},{"$f":"'0-INFOS GENERALES A REMPLIR'!$B$6","v":0},{"$f":"IF(ISBLANK('0-INFOS GENERALES A REMPLIR'!$E$13),\"\",'0-INFOS GENERALES A REMPLIR'!$E$13)","v":""},{"$f":"IF(ISBLANK('0-INFOS GENERALES A REMPLIR'!$A$13),\"\",'0-INFOS GENERALES A REMPLIR'!$A$13)","v":""},{"$f":"IF(ISBLANK('0-INFOS GENERALES A REMPLIR'!$D$13),\"\",'0-INFOS GENERALES A REMPLIR'!$D$13)","v":""},{"$f":"IFERROR(INDEX('listes valeurs'!F$2:F$552,MATCH(1,('listes valeurs'!B$2:B$552=B147)*('listes valeurs'!E$2:E$552=D147),0)),\"\")","v":""},null,null,null,null,{"$f":"'3-PAPILLONS'!$F$46","v":"Passage 2"},{"$f":"IF(ISBLANK('3-PAPILLONS'!$F$48),\"\",'3-PAPILLONS'!$F$48)","v":""},{"$f":"IF(ISBLANK('3-PAPILLONS'!$F$50),\"\",'3-PAPILLONS'!$F$50)","v":""},{"$f":"IF(ISBLANK('3-PAPILLONS'!$G$50),\"\",'3-PAPILLONS'!$G$50)","v":""},{"$f":"IF(ISBLANK('3-PAPILLONS'!$C$44),\"\",'3-PAPILLONS'!$C$44)","v":""},{"$f":"IF(ISBLANK('3-PAPILLONS'!$F$47),\"\",'3-PAPILLONS'!$F$47)","v":""},{"$f":"VLOOKUP('compilation données pour export'!$R147,'listes valeurs'!$X$2:$AA$3450,2,FALSE)","v":"Nacré de la sanguisorbe"},{"$f":"'3-PAPILLONS'!$A$22","v":"NAC"},{"$f":"VLOOKUP('compilation données pour export'!$R147,'listes valeurs'!$X$2:$AA$3450,4,FALSE)","v":"Brenthis ino"},{"$f":"VLOOKUP('compilation données pour export'!$R147,'listes valeurs'!$X$2:$AA$3450,3,FALSE)","v":"Papillons"},"Nombre individus",{"$f":"IF(ISBLANK('3-PAPILLONS'!G$58),\"\",'3-PAPILLONS'!G$58)","v":""},"out",{"$f":"'Synthese Annuelle Monitoring'!$Q$33","v":0}]
[{"$f":"'0-INFOS GENERALES A REMPLIR'!$B$4","v":2021},{"$f":"'0-INFOS GENERALES A REMPLIR'!$B$6","v":0},{"$f":"IF(ISBLANK('0-INFOS GENERALES A REMPLIR'!$E$14),\"\",'0-INFOS GENERALES A REMPLIR'!$E$14)","v":""},{"$f":"IF(ISBLANK('0-INFOS GENERALES A REMPLIR'!$A$14),\"\",'0-INFOS GENERALES A REMPLIR'!$A$14)","v":""},{"$f":"IF(ISBLANK('0-INFOS GENERALES A REMPLIR'!$D$14),\"\",'0-INFOS GENERALES A REMPLIR'!$D$14)","v":""},{"$f":"IFERROR(INDEX('listes valeurs'!F$2:F$552,MATCH(1,('listes valeurs'!B$2:B$552=B148)*('listes valeurs'!E$2:E$552=D148),0)),\"\")","v":""},null,null,null,null,{"$f":"'3-PAPILLONS'!$C$82","v":"Passage 1"},{"$f":"IF(ISBLANK('3-PAPILLONS'!$C$84),\"\",'3-PAPILLONS'!$C$84)","v":""},{"$f":"IF(ISBLANK('3-PAPILLONS'!$C$86),\"\",'3-PAPILLONS'!$C$86)","v":""},{"$f":"IF(ISBLANK('3-PAPILLONS'!$D$86),\"\",'3-PAPILLONS'!$D$86)","v":""},{"$f":"IF(ISBLANK('3-PAPILLONS'!$C$80),\"\",'3-PAPILLONS'!$C$80)","v":""},{"$f":"IF(ISBLANK('3-PAPILLONS'!$C$83),\"\",'3-PAPILLONS'!$C$83)","v":""},{"$f":"VLOOKUP('compilation données pour export'!$R148,'listes valeurs'!$X$2:$AA$3450,2,FALSE)","v":"Nacré de la sanguisorbe"},{"$f":"'3-PAPILLONS'!$A$22","v":"NAC"},{"$f":"VLOOKUP('compilation données pour export'!$R148,'listes valeurs'!$X$2:$AA$3450,4,FALSE)","v":"Brenthis ino"},{"$f":"VLOOKUP('compilation données pour export'!$R148,'listes valeurs'!$X$2:$AA$3450,3,FALSE)","v":"Papillons"},"Nombre individus",{"$f":"IF(ISBLANK('3-PAPILLONS'!C$94),\"\",'3-PAPILLONS'!C$94)","v":""},"in",{"$f":"'Synthese Annuelle Monitoring'!$Q$33","v":0}]
[{"$f":"'0-INFOS GENERALES A REMPLIR'!$B$4","v":2021},{"$f":"'0-INFOS GENERALES A REMPLIR'!$B$6","v":0},{"$f":"IF(ISBLANK('0-INFOS GENERALES A REMPLIR'!$E$14),\"\",'0-INFOS GENERALES A REMPLIR'!$E$14)","v":""},{"$f":"IF(ISBLANK('0-INFOS GENERALES A REMPLIR'!$A$14),\"\",'0-INFOS GENERALES A REMPLIR'!$A$14)","v":""},{"$f":"IF(ISBLANK('0-INFOS GENERALES A REMPLIR'!$D$14),\"\",'0-INFOS GENERALES A REMPLIR'!$D$14)","v":""},{"$f":"IFERROR(INDEX('listes valeurs'!F$2:F$552,MATCH(1,('listes valeurs'!B$2:B$552=B149)*('listes valeurs'!E$2:E$552=D149),0)),\"\")","v":""},null,null,null,null,{"$f":"'3-PAPILLONS'!$C$82","v":"Passage 1"},{"$f":"IF(ISBLANK('3-PAPILLONS'!$C$84),\"\",'3-PAPILLONS'!$C$84)","v":""},{"$f":"IF(ISBLANK('3-PAPILLONS'!$C$86),\"\",'3-PAPILLONS'!$C$86)","v":""},{"$f":"IF(ISBLANK('3-PAPILLONS'!$D$86),\"\",'3-PAPILLONS'!$D$86)","v":""},{"$f":"IF(ISBLANK('3-PAPILLONS'!$C$80),\"\",'3-PAPILLONS'!$C$80)","v":""},{"$f":"IF(ISBLANK('3-PAPILLONS'!$C$83),\"\",'3-PAPILLONS'!$C$83)","v":""},{"$f":"VLOOKUP('compilation données pour export'!$R149,'listes valeurs'!$X$2:$AA$3450,2,FALSE)","v":"Nacré de la sanguisorbe"},{"$f":"'3-PAPILLONS'!$A$22","v":"NAC"},{"$f":"VLOOKUP('compilation données pour export'!$R149,'listes valeurs'!$X$2:$AA$3450,4,FALSE)","v":"Brenthis ino"},{"$f":"VLOOKUP('compilation données pour export'!$R149,'listes valeurs'!$X$2:$AA$3450,3,FALSE)","v":"Papillons"},"Nombre individus",{"$f":"IF(ISBLANK('3-PAPILLONS'!D$94),\"\",'3-PAPILLONS'!D$94)","v":""},"out",{"$f":"'Synthese Annuelle Monitoring'!$Q$33","v":0}]
[{"$f":"'0-INFOS GENERALES A REMPLIR'!$B$4","v":2021},{"$f":"'0-INFOS GENERALES A REMPLIR'!$B$6","v":0},{"$f":"IF(ISBLANK('0-INFOS GENERALES A REMPLIR'!$E$14),\"\",'0-INFOS GENERALES A REMPLIR'!$E$14)","v":""},{"$f":"IF(ISBLANK('0-INFOS GENERALES A REMPLIR'!$A$14),\"\",'0-INFOS GENERALES A REMPLIR'!$A$14)","v":""},{"$f":"IF(ISBLANK('0-INFOS GENERALES A REMPLIR'!$D$14),\"\",'0-INFOS GENERALES A REMPLIR'!$D$14)","v":""},{"$f":"IFERROR(INDEX('listes valeurs'!F$2:F$552,MATCH(1,('listes valeurs'!B$2:B$552=B150)*('listes valeurs'!E$2:E$552=D150),0)),\"\")","v":""},null,null,null,null,{"$f":"'3-PAPILLONS'!$F$82","v":"Passage 2"},{"$f":"IF(ISBLANK('3-PAPILLONS'!$F$84),\"\",'3-PAPILLONS'!$F$84)","v":""},{"$f":"IF(ISBLANK('3-PAPILLONS'!$F$86),\"\",'3-PAPILLONS'!$F$86)","v":""},{"$f":"IF(ISBLANK('3-PAPILLONS'!$G$86),\"\",'3-PAPILLONS'!$G$86)","v":""},{"$f":"IF(ISBLANK('3-PAPILLONS'!$C$80),\"\",'3-PAPILLONS'!$C$80)","v":""},{"$f":"IF(ISBLANK('3-PAPILLONS'!$F$83),\"\",'3-PAPILLONS'!$F$83)","v":""},{"$f":"VLOOKUP('compilation données pour export'!$R150,'listes valeurs'!$X$2:$AA$3450,2,FALSE)","v":"Nacré de la sanguisorbe"},{"$f":"'3-PAPILLONS'!$A$22","v":"NAC"},{"$f":"VLOOKUP('compilation données pour export'!$R150,'listes valeurs'!$X$2:$AA$3450,4,FALSE)","v":"Brenthis ino"},{"$f":"VLOOKUP('compilation données pour export'!$R150,'listes valeurs'!$X$2:$AA$3450,3,FALSE)","v":"Papillons"},"Nombre individus",{"$f":"IF(ISBLANK('3-PAPILLONS'!F$94),\"\",'3-PAPILLONS'!F$94)","v":""},"in",{"$f":"'Synthese Annuelle Monitoring'!$Q$33","v":0}]
[{"$f":"'0-INFOS GENERALES A REMPLIR'!$B$4","v":2021},{"$f":"'0-INFOS GENERALES A REMPLIR'!$B$6","v":0},{"$f":"IF(ISBLANK('0-INFOS GENERALES A REMPLIR'!$E$14),\"\",'0-INFOS GENERALES A REMPLIR'!$E$14)","v":""},{"$f":"IF(ISBLANK('0-INFOS GENERALES A REMPLIR'!$A$14),\"\",'0-INFOS GENERALES A REMPLIR'!$A$14)","v":""},{"$f":"IF(ISBLANK('0-INFOS GENERALES A REMPLIR'!$D$14),\"\",'0-INFOS GENERALES A REMPLIR'!$D$14)","v":""},{"$f":"IFERROR(INDEX('listes valeurs'!F$2:F$552,MATCH(1,('listes valeurs'!B$2:B$552=B151)*('listes valeurs'!E$2:E$552=D151),0)),\"\")","v":""},null,null,null,null,{"$f":"'3-PAPILLONS'!$F$82","v":"Passage 2"},{"$f":"IF(ISBLANK('3-PAPILLONS'!$F$84),\"\",'3-PAPILLONS'!$F$84)","v":""},{"$f":"IF(ISBLANK('3-PAPILLONS'!$F$86),\"\",'3-PAPILLONS'!$F$86)","v":""},{"$f":"IF(ISBLANK('3-PAPILLONS'!$G$86),\"\",'3-PAPILLONS'!$G$86)","v":""},{"$f":"IF(ISBLANK('3-PAPILLONS'!$C$80),\"\",'3-PAPILLONS'!$C$80)","v":""},{"$f":"IF(ISBLANK('3-PAPILLONS'!$F$83),\"\",'3-PAPILLONS'!$F$83)","v":""},{"$f":"VLOOKUP('compilation données pour export'!$R151,'listes valeurs'!$X$2:$AA$3450,2,FALSE)","v":"Nacré de la sanguisorbe"},{"$f":"'3-PAPILLONS'!$A$22","v":"NAC"},{"$f":"VLOOKUP('compilation données pour export'!$R151,'listes valeurs'!$X$2:$AA$3450,4,FALSE)","v":"Brenthis ino"},{"$f":"VLOOKUP('compilation données pour export'!$R151,'listes valeurs'!$X$2:$AA$3450,3,FALSE)","v":"Papillons"},"Nombre individus",{"$f":"IF(ISBLANK('3-PAPILLONS'!G$94),\"\",'3-PAPILLONS'!G$94)","v":""},"out",{"$f":"'Synthese Annuelle Monitoring'!$Q$33","v":0}]
[{"$f":"'0-INFOS GENERALES A REMPLIR'!$B$4","v":2021},{"$f":"'0-INFOS GENERALES A REMPLIR'!$B$6","v":0},{"$f":"IF(ISBLANK('0-INFOS GENERALES A REMPLIR'!$E$15),\"\",'0-INFOS GENERALES A REMPLIR'!$E$15)","v":""},{"$f":"IF(ISBLANK('0-INFOS GENERALES A REMPLIR'!$A$15),\"\",'0-INFOS GENERALES A REMPLIR'!$A$15)","v":""},{"$f":"IF(ISBLANK('0-INFOS GENERALES A REMPLIR'!$D$15),\"\",'0-INFOS GENERALES A REMPLIR'!$D$15)","v":""},{"$f":"IFERROR(INDEX('listes valeurs'!F$2:F$552,MATCH(1,('listes valeurs'!B$2:B$552=B152)*('listes valeurs'!E$2:E$552=D152),0)),\"\")","v":""},null,null,null,null,{"$f":"'3-PAPILLONS'!$C$118","v":"Passage 1"},{"$f":"IF(ISBLANK('3-PAPILLONS'!$C$120),\"\",'3-PAPILLONS'!$C$120)","v":""},{"$f":"IF(ISBLANK('3-PAPILLONS'!$C$122),\"\",'3-PAPILLONS'!$C$122)","v":""},{"$f":"IF(ISBLANK('3-PAPILLONS'!$D$122),\"\",'3-PAPILLONS'!$D$122)","v":""},{"$f":"IF(ISBLANK('3-PAPILLONS'!$C$116),\"\",'3-PAPILLONS'!$C$116)","v":""},{"$f":"IF(ISBLANK('3-PAPILLONS'!$C$119),\"\",'3-PAPILLONS'!$C$119)","v":""},{"$f":"VLOOKUP('compilation données pour export'!$R152,'listes valeurs'!$X$2:$AA$3450,2,FALSE)","v":"Nacré de la sanguisorbe"},{"$f":"'3-PAPILLONS'!$A$22","v":"NAC"},{"$f":"VLOOKUP('compilation données pour export'!$R152,'listes valeurs'!$X$2:$AA$3450,4,FALSE)","v":"Brenthis ino"},{"$f":"VLOOKUP('compilation données pour export'!$R152,'listes valeurs'!$X$2:$AA$3450,3,FALSE)","v":"Papillons"},"Nombre individus",{"$f":"IF(ISBLANK('3-PAPILLONS'!C$130),\"\",'3-PAPILLONS'!C$130)","v":""},"in",{"$f":"'Synthese Annuelle Monitoring'!$Q$33","v":0}]
[{"$f":"'0-INFOS GENERALES A REMPLIR'!$B$4","v":2021},{"$f":"'0-INFOS GENERALES A REMPLIR'!$B$6","v":0},{"$f":"IF(ISBLANK('0-INFOS GENERALES A REMPLIR'!$E$15),\"\",'0-INFOS GENERALES A REMPLIR'!$E$15)","v":""},{"$f":"IF(ISBLANK('0-INFOS GENERALES A REMPLIR'!$A$15),\"\",'0-INFOS GENERALES A REMPLIR'!$A$15)","v":""},{"$f":"IF(ISBLANK('0-INFOS GENERALES A REMPLIR'!$D$15),\"\",'0-INFOS GENERALES A REMPLIR'!$D$15)","v":""},{"$f":"IFERROR(INDEX('listes valeurs'!F$2:F$552,MATCH(1,('listes valeurs'!B$2:B$552=B153)*('listes valeurs'!E$2:E$552=D153),0)),\"\")","v":""},null,null,null,null,{"$f":"'3-PAPILLONS'!$C$118","v":"Passage 1"},{"$f":"IF(ISBLANK('3-PAPILLONS'!$C$120),\"\",'3-PAPILLONS'!$C$120)","v":""},{"$f":"IF(ISBLANK('3-PAPILLONS'!$C$122),\"\",'3-PAPILLONS'!$C$122)","v":""},{"$f":"IF(ISBLANK('3-PAPILLONS'!$D$122),\"\",'3-PAPILLONS'!$D$122)","v":""},{"$f":"IF(ISBLANK('3-PAPILLONS'!$C$116),\"\",'3-PAPILLONS'!$C$116)","v":""},{"$f":"IF(ISBLANK('3-PAPILLONS'!$C$119),\"\",'3-PAPILLONS'!$C$119)","v":""},{"$f":"VLOOKUP('compilation données pour export'!$R153,'listes valeurs'!$X$2:$AA$3450,2,FALSE)","v":"Nacré de la sanguisorbe"},{"$f":"'3-PAPILLONS'!$A$22","v":"NAC"},{"$f":"VLOOKUP('compilation données pour export'!$R153,'listes valeurs'!$X$2:$AA$3450,4,FALSE)","v":"Brenthis ino"},{"$f":"VLOOKUP('compilation données pour export'!$R153,'listes valeurs'!$X$2:$AA$3450,3,FALSE)","v":"Papillons"},"Nombre individus",{"$f":"IF(ISBLANK('3-PAPILLONS'!D$130),\"\",'3-PAPILLONS'!D$130)","v":""},"out",{"$f":"'Synthese Annuelle Monitoring'!$Q$33","v":0}]
[{"$f":"'0-INFOS GENERALES A REMPLIR'!$B$4","v":2021},{"$f":"'0-INFOS GENERALES A REMPLIR'!$B$6","v":0},{"$f":"IF(ISBLANK('0-INFOS GENERALES A REMPLIR'!$E$15),\"\",'0-INFOS GENERALES A REMPLIR'!$E$15)","v":""},{"$f":"IF(ISBLANK('0-INFOS GENERALES A REMPLIR'!$A$15),\"\",'0-INFOS GENERALES A REMPLIR'!$A$15)","v":""},{"$f":"IF(ISBLANK('0-INFOS GENERALES A REMPLIR'!$D$15),\"\",'0-INFOS GENERALES A REMPLIR'!$D$15)","v":""},{"$f":"IFERROR(INDEX('listes valeurs'!F$2:F$552,MATCH(1,('listes valeurs'!B$2:B$552=B154)*('listes valeurs'!E$2:E$552=D154),0)),\"\")","v":""},null,null,null,null,{"$f":"'3-PAPILLONS'!$F$118","v":"Passage 2"},{"$f":"IF(ISBLANK('3-PAPILLONS'!$F$120),\"\",'3-PAPILLONS'!$F$120)","v":""},{"$f":"IF(ISBLANK('3-PAPILLONS'!$F$122),\"\",'3-PAPILLONS'!$F$122)","v":""},{"$f":"IF(ISBLANK('3-PAPILLONS'!$G$122),\"\",'3-PAPILLONS'!$G$122)","v":""},{"$f":"IF(ISBLANK('3-PAPILLONS'!$C$116),\"\",'3-PAPILLONS'!$C$116)","v":""},{"$f":"IF(ISBLANK('3-PAPILLONS'!$F$119),\"\",'3-PAPILLONS'!$F$119)","v":""},{"$f":"VLOOKUP('compilation données pour export'!$R154,'listes valeurs'!$X$2:$AA$3450,2,FALSE)","v":"Nacré de la sanguisorbe"},{"$f":"'3-PAPILLONS'!$A$22","v":"NAC"},{"$f":"VLOOKUP('compilation données pour export'!$R154,'listes valeurs'!$X$2:$AA$3450,4,FALSE)","v":"Brenthis ino"},{"$f":"VLOOKUP('compilation données pour export'!$R154,'listes valeurs'!$X$2:$AA$3450,3,FALSE)","v":"Papillons"},"Nombre individus",{"$f":"IF(ISBLANK('3-PAPILLONS'!F$130),\"\",'3-PAPILLONS'!F$130)","v":""},"in",{"$f":"'Synthese Annuelle Monitoring'!$Q$33","v":0}]
[{"$f":"'0-INFOS GENERALES A REMPLIR'!$B$4","v":2021},{"$f":"'0-INFOS GENERALES A REMPLIR'!$B$6","v":0},{"$f":"IF(ISBLANK('0-INFOS GENERALES A REMPLIR'!$E$15),\"\",'0-INFOS GENERALES A REMPLIR'!$E$15)","v":""},{"$f":"IF(ISBLANK('0-INFOS GENERALES A REMPLIR'!$A$15),\"\",'0-INFOS GENERALES A REMPLIR'!$A$15)","v":""},{"$f":"IF(ISBLANK('0-INFOS GENERALES A REMPLIR'!$D$15),\"\",'0-INFOS GENERALES A REMPLIR'!$D$15)","v":""},{"$f":"IFERROR(INDEX('listes valeurs'!F$2:F$552,MATCH(1,('listes valeurs'!B$2:B$552=B155)*('listes valeurs'!E$2:E$552=D155),0)),\"\")","v":""},null,null,null,null,{"$f":"'3-PAPILLONS'!$F$118","v":"Passage 2"},{"$f":"IF(ISBLANK('3-PAPILLONS'!$F$120),\"\",'3-PAPILLONS'!$F$120)","v":""},{"$f":"IF(ISBLANK('3-PAPILLONS'!$F$122),\"\",'3-PAPILLONS'!$F$122)","v":""},{"$f":"IF(ISBLANK('3-PAPILLONS'!$G$122),\"\",'3-PAPILLONS'!$G$122)","v":""},{"$f":"IF(ISBLANK('3-PAPILLONS'!$C$116),\"\",'3-PAPILLONS'!$C$116)","v":""},{"$f":"IF(ISBLANK('3-PAPILLONS'!$F$119),\"\",'3-PAPILLONS'!$F$119)","v":""},{"$f":"VLOOKUP('compilation données pour export'!$R155,'listes valeurs'!$X$2:$AA$3450,2,FALSE)","v":"Nacré de la sanguisorbe"},{"$f":"'3-PAPILLONS'!$A$22","v":"NAC"},{"$f":"VLOOKUP('compilation données pour export'!$R155,'listes valeurs'!$X$2:$AA$3450,4,FALSE)","v":"Brenthis ino"},{"$f":"VLOOKUP('compilation données pour export'!$R155,'listes valeurs'!$X$2:$AA$3450,3,FALSE)","v":"Papillons"},"Nombre individus",{"$f":"IF(ISBLANK('3-PAPILLONS'!G$130),\"\",'3-PAPILLONS'!G$130)","v":""},"out",{"$f":"'Synthese Annuelle Monitoring'!$Q$33","v":0}]
[{"$f":"'0-INFOS GENERALES A REMPLIR'!$B$4","v":2021},{"$f":"'0-INFOS GENERALES A REMPLIR'!$B$6","v":0},{"$f":"IF(ISBLANK('0-INFOS GENERALES A REMPLIR'!$E$16),\"\",'0-INFOS GENERALES A REMPLIR'!$E$16)","v":""},{"$f":"IF(ISBLANK('0-INFOS GENERALES A REMPLIR'!$A$16),\"\",'0-INFOS GENERALES A REMPLIR'!$A$16)","v":""},{"$f":"IF(ISBLANK('0-INFOS GENERALES A REMPLIR'!$D$16),\"\",'0-INFOS GENERALES A REMPLIR'!$D$16)","v":""},{"$f":"IFERROR(INDEX('listes valeurs'!F$2:F$552,MATCH(1,('listes valeurs'!B$2:B$552=B156)*('listes valeurs'!E$2:E$552=D156),0)),\"\")","v":""},null,null,null,null,{"$f":"'3-PAPILLONS'!$C$154","v":"Passage 1"},{"$f":"IF(ISBLANK('3-PAPILLONS'!$C$156),\"\",'3-PAPILLONS'!$C$156)","v":""},{"$f":"IF(ISBLANK('3-PAPILLONS'!$C$158),\"\",'3-PAPILLONS'!$C$158)","v":""},{"$f":"IF(ISBLANK('3-PAPILLONS'!$D$158),\"\",'3-PAPILLONS'!$D$158)","v":""},{"$f":"IF(ISBLANK('3-PAPILLONS'!$C$152),\"\",'3-PAPILLONS'!$C$152)","v":""},{"$f":"IF(ISBLANK('3-PAPILLONS'!$C$155),\"\",'3-PAPILLONS'!$C$155)","v":""},{"$f":"VLOOKUP('compilation données pour export'!$R156,'listes valeurs'!$X$2:$AA$3450,2,FALSE)","v":"Nacré de la sanguisorbe"},{"$f":"'3-PAPILLONS'!$A$22","v":"NAC"},{"$f":"VLOOKUP('compilation données pour export'!$R156,'listes valeurs'!$X$2:$AA$3450,4,FALSE)","v":"Brenthis ino"},{"$f":"VLOOKUP('compilation données pour export'!$R156,'listes valeurs'!$X$2:$AA$3450,3,FALSE)","v":"Papillons"},"Nombre individus",{"$f":"IF(ISBLANK('3-PAPILLONS'!C$166),\"\",'3-PAPILLONS'!C$166)","v":""},"in",{"$f":"'Synthese Annuelle Monitoring'!$Q$33","v":0}]
[{"$f":"'0-INFOS GENERALES A REMPLIR'!$B$4","v":2021},{"$f":"'0-INFOS GENERALES A REMPLIR'!$B$6","v":0},{"$f":"IF(ISBLANK('0-INFOS GENERALES A REMPLIR'!$E$16),\"\",'0-INFOS GENERALES A REMPLIR'!$E$16)","v":""},{"$f":"IF(ISBLANK('0-INFOS GENERALES A REMPLIR'!$A$16),\"\",'0-INFOS GENERALES A REMPLIR'!$A$16)","v":""},{"$f":"IF(ISBLANK('0-INFOS GENERALES A REMPLIR'!$D$16),\"\",'0-INFOS GENERALES A REMPLIR'!$D$16)","v":""},{"$f":"IFERROR(INDEX('listes valeurs'!F$2:F$552,MATCH(1,('listes valeurs'!B$2:B$552=B157)*('listes valeurs'!E$2:E$552=D157),0)),\"\")","v":""},null,null,null,null,{"$f":"'3-PAPILLONS'!$C$154","v":"Passage 1"},{"$f":"IF(ISBLANK('3-PAPILLONS'!$C$156),\"\",'3-PAPILLONS'!$C$156)","v":""},{"$f":"IF(ISBLANK('3-PAPILLONS'!$C$158),\"\",'3-PAPILLONS'!$C$158)","v":""},{"$f":"IF(ISBLANK('3-PAPILLONS'!$D$158),\"\",'3-PAPILLONS'!$D$158)","v":""},{"$f":"IF(ISBLANK('3-PAPILLONS'!$C$152),\"\",'3-PAPILLONS'!$C$152)","v":""},{"$f":"IF(ISBLANK('3-PAPILLONS'!$C$155),\"\",'3-PAPILLONS'!$C$155)","v":""},{"$f":"VLOOKUP('compilation données pour export'!$R157,'listes valeurs'!$X$2:$AA$3450,2,FALSE)","v":"Nacré de la sanguisorbe"},{"$f":"'3-PAPILLONS'!$A$22","v":"NAC"},{"$f":"VLOOKUP('compilation données pour export'!$R157,'listes valeurs'!$X$2:$AA$3450,4,FALSE)","v":"Brenthis ino"},{"$f":"VLOOKUP('compilation données pour export'!$R157,'listes valeurs'!$X$2:$AA$3450,3,FALSE)","v":"Papillons"},"Nombre individus",{"$f":"IF(ISBLANK('3-PAPILLONS'!D$166),\"\",'3-PAPILLONS'!D$166)","v":""},"out",{"$f":"'Synthese Annuelle Monitoring'!$Q$33","v":0}]
[{"$f":"'0-INFOS GENERALES A REMPLIR'!$B$4","v":2021},{"$f":"'0-INFOS GENERALES A REMPLIR'!$B$6","v":0},{"$f":"IF(ISBLANK('0-INFOS GENERALES A REMPLIR'!$E$16),\"\",'0-INFOS GENERALES A REMPLIR'!$E$16)","v":""},{"$f":"IF(ISBLANK('0-INFOS GENERALES A REMPLIR'!$A$16),\"\",'0-INFOS GENERALES A REMPLIR'!$A$16)","v":""},{"$f":"IF(ISBLANK('0-INFOS GENERALES A REMPLIR'!$D$16),\"\",'0-INFOS GENERALES A REMPLIR'!$D$16)","v":""},{"$f":"IFERROR(INDEX('listes valeurs'!F$2:F$552,MATCH(1,('listes valeurs'!B$2:B$552=B158)*('listes valeurs'!E$2:E$552=D158),0)),\"\")","v":""},null,null,null,null,{"$f":"'3-PAPILLONS'!$F$154","v":"Passage 2"},{"$f":"IF(ISBLANK('3-PAPILLONS'!$F$156),\"\",'3-PAPILLONS'!$F$156)","v":""},{"$f":"IF(ISBLANK('3-PAPILLONS'!$F$158),\"\",'3-PAPILLONS'!$F$158)","v":""},{"$f":"IF(ISBLANK('3-PAPILLONS'!$G$158),\"\",'3-PAPILLONS'!$G$158)","v":""},{"$f":"IF(ISBLANK('3-PAPILLONS'!$C$152),\"\",'3-PAPILLONS'!$C$152)","v":""},{"$f":"IF(ISBLANK('3-PAPILLONS'!$F$155),\"\",'3-PAPILLONS'!$F$155)","v":""},{"$f":"VLOOKUP('compilation données pour export'!$R158,'listes valeurs'!$X$2:$AA$3450,2,FALSE)","v":"Nacré de la sanguisorbe"},{"$f":"'3-PAPILLONS'!$A$22","v":"NAC"},{"$f":"VLOOKUP('compilation données pour export'!$R158,'listes valeurs'!$X$2:$AA$3450,4,FALSE)","v":"Brenthis ino"},{"$f":"VLOOKUP('compilation données pour export'!$R158,'listes valeurs'!$X$2:$AA$3450,3,FALSE)","v":"Papillons"},"Nombre individus",{"$f":"IF(ISBLANK('3-PAPILLONS'!F$166),\"\",'3-PAPILLONS'!F$166)","v":""},"in",{"$f":"'Synthese Annuelle Monitoring'!$Q$33","v":0}]
[{"$f":"'0-INFOS GENERALES A REMPLIR'!$B$4","v":2021},{"$f":"'0-INFOS GENERALES A REMPLIR'!$B$6","v":0},{"$f":"IF(ISBLANK('0-INFOS GENERALES A REMPLIR'!$E$16),\"\",'0-INFOS GENERALES A REMPLIR'!$E$16)","v":""},{"$f":"IF(ISBLANK('0-INFOS GENERALES A REMPLIR'!$A$16),\"\",'0-INFOS GENERALES A REMPLIR'!$A$16)","v":""},{"$f":"IF(ISBLANK('0-INFOS GENERALES A REMPLIR'!$D$16),\"\",'0-INFOS GENERALES A REMPLIR'!$D$16)","v":""},{"$f":"IFERROR(INDEX('listes valeurs'!F$2:F$552,MATCH(1,('listes valeurs'!B$2:B$552=B159)*('listes valeurs'!E$2:E$552=D159),0)),\"\")","v":""},null,null,null,null,{"$f":"'3-PAPILLONS'!$F$154","v":"Passage 2"},{"$f":"IF(ISBLANK('3-PAPILLONS'!$F$156),\"\",'3-PAPILLONS'!$F$156)","v":""},{"$f":"IF(ISBLANK('3-PAPILLONS'!$F$158),\"\",'3-PAPILLONS'!$F$158)","v":""},{"$f":"IF(ISBLANK('3-PAPILLONS'!$G$158),\"\",'3-PAPILLONS'!$G$158)","v":""},{"$f":"IF(ISBLANK('3-PAPILLONS'!$C$152),\"\",'3-PAPILLONS'!$C$152)","v":""},{"$f":"IF(ISBLANK('3-PAPILLONS'!$F$155),\"\",'3-PAPILLONS'!$F$155)","v":""},{"$f":"VLOOKUP('compilation données pour export'!$R159,'listes valeurs'!$X$2:$AA$3450,2,FALSE)","v":"Nacré de la sanguisorbe"},{"$f":"'3-PAPILLONS'!$A$22","v":"NAC"},{"$f":"VLOOKUP('compilation données pour export'!$R159,'listes valeurs'!$X$2:$AA$3450,4,FALSE)","v":"Brenthis ino"},{"$f":"VLOOKUP('compilation données pour export'!$R159,'listes valeurs'!$X$2:$AA$3450,3,FALSE)","v":"Papillons"},"Nombre individus",{"$f":"IF(ISBLANK('3-PAPILLONS'!G$166),\"\",'3-PAPILLONS'!G$166)","v":""},"out",{"$f":"'Synthese Annuelle Monitoring'!$Q$33","v":0}]
[{"$f":"'0-INFOS GENERALES A REMPLIR'!$B$4","v":2021},{"$f":"'0-INFOS GENERALES A REMPLIR'!$B$6","v":0},{"$f":"'0-INFOS GENERALES A REMPLIR'!$E$12","v":""},null,null,null,{"$f":"IF(ISBLANK('4-PLANTES'!$A$18),\"\",'4-PLANTES'!$A$18)","v":""},{"$f":"IF(G160=\"\",\"\",CONCATENATE(C160,\"_\",G160))","v":""},{"$f":"IF(ISBLANK('4-PLANTES'!$E$6),\"\",'4-PLANTES'!$E$6)","v":0},{"$f":"IF(ISBLANK('4-PLANTES'!$E$8),\"\",'4-PLANTES'!$E$8)","v":0},null,{"$f":"IF(ISBLANK('4-PLANTES'!$E$12),\"\",'4-PLANTES'!$E$12)","v":""},null,null,{"$f":"IF(ISBLANK('4-PLANTES'!$E$10),\"\",'4-PLANTES'!$E$10)","v":""},null,{"$f":"VLOOKUP('compilation données pour export'!$R160,'listes valeurs'!$AB$2:$AE$3450,2,FALSE)","v":"Silène de nuit"},{"$f":"'4-PLANTES'!$B$17","v":"Silene"},{"$f":"VLOOKUP('compilation données pour export'!$R160,'listes valeurs'!$AB$2:$AE$3450,4,FALSE)","v":"Silene noctiflora"},{"$f":"VLOOKUP('compilation données pour export'!$R160,'listes valeurs'!$AB$2:$AE$3450,3,FALSE)","v":"Plantes"},"Présence/absence",{"$f":"IF(ISBLANK('4-PLANTES'!$B$18),\"\",'4-PLANTES'!$B$18)","v":""},"in",{"$f":"'Synthese Annuelle Monitoring'!$Q$36","v":0}]
[{"$f":"'0-INFOS GENERALES A REMPLIR'!$B$4","v":2021},{"$f":"'0-INFOS GENERALES A REMPLIR'!$B$6","v":0},{"$f":"'0-INFOS GENERALES A REMPLIR'!$E$12","v":""},null,null,null,{"$f":"IF(ISBLANK('4-PLANTES'!$A19),\"\",'4-PLANTES'!$A19)","v":""},"",{"$f":"IF(ISBLANK('4-PLANTES'!$E$6),\"\",'4-PLANTES'!$E$6)","v":0},{"$f":"IF(ISBLANK('4-PLANTES'!$E$8),\"\",'4-PLANTES'!$E$8)","v":0},null,{"$f":"IF(ISBLANK('4-PLANTES'!$E$12),\"\",'4-PLANTES'!$E$12)","v":""},null,null,{"$f":"IF(ISBLANK('4-PLANTES'!$E$10),\"\",'4-PLANTES'!$E$10)","v":""},null,{"$f":"VLOOKUP('compilation données pour export'!$R161,'listes valeurs'!$AB$2:$AE$3450,2,FALSE)","v":"Silène de nuit"},{"$f":"'4-PLANTES'!$B$17","v":"Silene"},{"$f":"VLOOKUP('compilation données pour export'!$R161,'listes valeurs'!$AB$2:$AE$3450,4,FALSE)","v":"Silene noctiflora"},{"$f":"VLOOKUP('compilation données pour export'!$R161,'listes valeurs'!$AB$2:$AE$3450,3,FALSE)","v":"Plantes"},"Présence/absence",{"$f":"IF(ISBLANK('4-PLANTES'!$B$19),\"\",'4-PLANTES'!$B$19)","v":""},"in",{"$f":"'Synthese Annuelle Monitoring'!$Q$36","v":0}]
[{"$f":"'0-INFOS GENERALES A REMPLIR'!$B$4","v":2021},{"$f":"'0-INFOS GENERALES A REMPLIR'!$B$6","v":0},{"$f":"'0-INFOS GENERALES A REMPLIR'!$E$12","v":""},null,null,null,{"$f":"IF(ISBLANK('4-PLANTES'!$A20),\"\",'4-PLANTES'!$A20)","v":""},"",{"$f":"IF(ISBLANK('4-PLANTES'!$E$6),\"\",'4-PLANTES'!$E$6)","v":0},{"$f":"IF(ISBLANK('4-PLANTES'!$E$8),\"\",'4-PLANTES'!$E$8)","v":0},null,{"$f":"IF(ISBLANK('4-PLANTES'!$E$12),\"\",'4-PLANTES'!$E$12)","v":""},null,null,{"$f":"IF(ISBLANK('4-PLANTES'!$E$10),\"\",'4-PLANTES'!$E$10)","v":""},null,{"$f":"VLOOKUP('compilation données pour export'!$R162,'listes valeurs'!$AB$2:$AE$3450,2,FALSE)","v":"Silène de nuit"},{"$f":"'4-PLANTES'!$B$17","v":"Silene"},{"$f":"VLOOKUP('compilation données pour export'!$R162,'listes valeurs'!$AB$2:$AE$3450,4,FALSE)","v":"Silene noctiflora"},{"$f":"VLOOKUP('compilation données pour export'!$R162,'listes valeurs'!$AB$2:$AE$3450,3,FALSE)","v":"Plantes"},"Présence/absence",{"$f":"IF(ISBLANK('4-PLANTES'!$B$20),\"\",'4-PLANTES'!$B$20)","v":""},"in",{"$f":"'Synthese Annuelle Monitoring'!$Q$36","v":0}]
[{"$f":"'0-INFOS GENERALES A REMPLIR'!$B$4","v":2021},{"$f":"'0-INFOS GENERALES A REMPLIR'!$B$6","v":0},{"$f":"'0-INFOS GENERALES A REMPLIR'!$E$12","v":""},null,null,null,{"$f":"IF(ISBLANK('4-PLANTES'!$A21),\"\",'4-PLANTES'!$A21)","v":""},"",{"$f":"IF(ISBLANK('4-PLANTES'!$E$6),\"\",'4-PLANTES'!$E$6)","v":0},{"$f":"IF(ISBLANK('4-PLANTES'!$E$8),\"\",'4-PLANTES'!$E$8)","v":0},null,{"$f":"IF(ISBLANK('4-PLANTES'!$E$12),\"\",'4-PLANTES'!$E$12)","v":""},null,null,{"$f":"IF(ISBLANK('4-PLANTES'!$E$10),\"\",'4-PLANTES'!$E$10)","v":""},null,{"$f":"VLOOKUP('compilation données pour export'!$R163,'listes valeurs'!$AB$2:$AE$3450,2,FALSE)","v":"Silène de nuit"},{"$f":"'4-PLANTES'!$B$17","v":"Silene"},{"$f":"VLOOKUP('compilation données pour export'!$R163,'listes valeurs'!$AB$2:$AE$3450,4,FALSE)","v":"Silene noctiflora"},{"$f":"VLOOKUP('compilation données pour export'!$R163,'listes valeurs'!$AB$2:$AE$3450,3,FALSE)","v":"Plantes"},"Présence/absence",{"$f":"IF(ISBLANK('4-PLANTES'!$B$21),\"\",'4-PLANTES'!$B$21)","v":""},"in",{"$f":"'Synthese Annuelle Monitoring'!$Q$36","v":0}]
[{"$f":"'0-INFOS GENERALES A REMPLIR'!$B$4","v":2021},{"$f":"'0-INFOS GENERALES A REMPLIR'!$B$6","v":0},{"$f":"'0-INFOS GENERALES A REMPLIR'!$E$12","v":""},null,null,null,{"$f":"IF(ISBLANK('4-PLANTES'!$A22),\"\",'4-PLANTES'!$A22)","v":""},"",{"$f":"IF(ISBLANK('4-PLANTES'!$E$6),\"\",'4-PLANTES'!$E$6)","v":0},{"$f":"IF(ISBLANK('4-PLANTES'!$E$8),\"\",'4-PLANTES'!$E$8)","v":0},null,{"$f":"IF(ISBLANK('4-PLANTES'!$E$12),\"\",'4-PLANTES'!$E$12)","v":""},null,null,{"$f":"IF(ISBLANK('4-PLANTES'!$E$10),\"\",'4-PLANTES'!$E$10)","v":""},null,{"$f":"VLOOKUP('compilation données pour export'!$R164,'listes valeurs'!$AB$2:$AE$3450,2,FALSE)","v":"Silène de nuit"},{"$f":"'4-PLANTES'!$B$17","v":"Silene"},{"$f":"VLOOKUP('compilation données pour export'!$R164,'listes valeurs'!$AB$2:$AE$3450,4,FALSE)","v":"Silene noctiflora"},{"$f":"VLOOKUP('compilation données pour export'!$R164,'listes valeurs'!$AB$2:$AE$3450,3,FALSE)","v":"Plantes"},"Présence/absence",{"$f":"IF(ISBLANK('4-PLANTES'!$B$22),\"\",'4-PLANTES'!$B$22)","v":""},"in",{"$f":"'Synthese Annuelle Monitoring'!$Q$36","v":0}]
[{"$f":"'0-INFOS GENERALES A REMPLIR'!$B$4","v":2021},{"$f":"'0-INFOS GENERALES A REMPLIR'!$B$6","v":0},{"$f":"'0-INFOS GENERALES A REMPLIR'!$E$12","v":""},null,null,null,{"$f":"IF(ISBLANK('4-PLANTES'!$A23),\"\",'4-PLANTES'!$A23)","v":""},"",{"$f":"IF(ISBLANK('4-PLANTES'!$E$6),\"\",'4-PLANTES'!$E$6)","v":0},{"$f":"IF(ISBLANK('4-PLANTES'!$E$8),\"\",'4-PLANTES'!$E$8)","v":0},null,{"$f":"IF(ISBLANK('4-PLANTES'!$E$12),\"\",'4-PLANTES'!$E$12)","v":""},null,null,{"$f":"IF(ISBLANK('4-PLANTES'!$E$10),\"\",'4-PLANTES'!$E$10)","v":""},null,{"$f":"VLOOKUP('compilation données pour export'!$R165,'listes valeurs'!$AB$2:$AE$3450,2,FALSE)","v":"Silène de nuit"},{"$f":"'4-PLANTES'!$B$17","v":"Silene"},{"$f":"VLOOKUP('compilation données pour export'!$R165,'listes valeurs'!$AB$2:$AE$3450,4,FALSE)","v":"Silene noctiflora"},{"$f":"VLOOKUP('compilation données pour export'!$R165,'listes valeurs'!$AB$2:$AE$3450,3,FALSE)","v":"Plantes"},"Présence/absence",{"$f":"IF(ISBLANK('4-PLANTES'!$B$23),\"\",'4-PLANTES'!$B$23)","v":""},"in",{"$f":"'Synthese Annuelle Monitoring'!$Q$36","v":0}]
[{"$f":"'0-INFOS GENERALES A REMPLIR'!$B$4","v":2021},{"$f":"'0-INFOS GENERALES A REMPLIR'!$B$6","v":0},{"$f":"'0-INFOS GENERALES A REMPLIR'!$E$12","v":""},null,null,null,{"$f":"IF(ISBLANK('4-PLANTES'!$A24),\"\",'4-PLANTES'!$A24)","v":""},"",{"$f":"IF(ISBLANK('4-PLANTES'!$E$6),\"\",'4-PLANTES'!$E$6)","v":0},{"$f":"IF(ISBLANK('4-PLANTES'!$E$8),\"\",'4-PLANTES'!$E$8)","v":0},null,{"$f":"IF(ISBLANK('4-PLANTES'!$E$12),\"\",'4-PLANTES'!$E$12)","v":""},null,null,{"$f":"IF(ISBLANK('4-PLANTES'!$E$10),\"\",'4-PLANTES'!$E$10)","v":""},null,{"$f":"VLOOKUP('compilation données pour export'!$R166,'listes valeurs'!$AB$2:$AE$3450,2,FALSE)","v":"Silène de nuit"},{"$f":"'4-PLANTES'!$B$17","v":"Silene"},{"$f":"VLOOKUP('compilation données pour export'!$R166,'listes valeurs'!$AB$2:$AE$3450,4,FALSE)","v":"Silene noctiflora"},{"$f":"VLOOKUP('compilation données pour export'!$R166,'listes valeurs'!$AB$2:$AE$3450,3,FALSE)","v":"Plantes"},"Présence/absence",{"$f":"IF(ISBLANK('4-PLANTES'!$B$24),\"\",'4-PLANTES'!$B$24)","v":""},"in",{"$f":"'Synthese Annuelle Monitoring'!$Q$36","v":0}]
[{"$f":"'0-INFOS GENERALES A REMPLIR'!$B$4","v":2021},{"$f":"'0-INFOS GENERALES A REMPLIR'!$B$6","v":0},{"$f":"'0-INFOS GENERALES A REMPLIR'!$E$12","v":""},null,null,null,{"$f":"IF(ISBLANK('4-PLANTES'!$A25),\"\",'4-PLANTES'!$A25)","v":""},"",{"$f":"IF(ISBLANK('4-PLANTES'!$E$6),\"\",'4-PLANTES'!$E$6)","v":0},{"$f":"IF(ISBLANK('4-PLANTES'!$E$8),\"\",'4-PLANTES'!$E$8)","v":0},null,{"$f":"IF(ISBLANK('4-PLANTES'!$E$12),\"\",'4-PLANTES'!$E$12)","v":""},null,null,{"$f":"IF(ISBLANK('4-PLANTES'!$E$10),\"\",'4-PLANTES'!$E$10)","v":""},null,{"$f":"VLOOKUP('compilation données pour export'!$R167,'listes valeurs'!$AB$2:$AE$3450,2,FALSE)","v":"Silène de nuit"},{"$f":"'4-PLANTES'!$B$17","v":"Silene"},{"$f":"VLOOKUP('compilation données pour export'!$R167,'listes valeurs'!$AB$2:$AE$3450,4,FALSE)","v":"Silene noctiflora"},{"$f":"VLOOKUP('compilation données pour export'!$R167,'listes valeurs'!$AB$2:$AE$3450,3,FALSE)","v":"Plantes"},"Présence/absence",{"$f":"IF(ISBLANK('4-PLANTES'!$B$25),\"\",'4-PLANTES'!$B$25)","v":""},"in",{"$f":"'Synthese Annuelle Monitoring'!$Q$36","v":0}]
[{"$f":"'0-INFOS GENERALES A REMPLIR'!$B$4","v":2021},{"$f":"'0-INFOS GENERALES A REMPLIR'!$B$6","v":0},{"$f":"'0-INFOS GENERALES A REMPLIR'!$E$12","v":""},null,null,null,{"$f":"IF(ISBLANK('4-PLANTES'!$A26),\"\",'4-PLANTES'!$A26)","v":""},"",{"$f":"IF(ISBLANK('4-PLANTES'!$E$6),\"\",'4-PLANTES'!$E$6)","v":0},{"$f":"IF(ISBLANK('4-PLANTES'!$E$8),\"\",'4-PLANTES'!$E$8)","v":0},null,{"$f":"IF(ISBLANK('4-PLANTES'!$E$12),\"\",'4-PLANTES'!$E$12)","v":""},null,null,{"$f":"IF(ISBLANK('4-PLANTES'!$E$10),\"\",'4-PLANTES'!$E$10)","v":""},null,{"$f":"VLOOKUP('compilation données pour export'!$R168,'listes valeurs'!$AB$2:$AE$3450,2,FALSE)","v":"Silène de nuit"},{"$f":"'4-PLANTES'!$B$17","v":"Silene"},{"$f":"VLOOKUP('compilation données pour export'!$R168,'listes valeurs'!$AB$2:$AE$3450,4,FALSE)","v":"Silene noctiflora"},{"$f":"VLOOKUP('compilation données pour export'!$R168,'listes valeurs'!$AB$2:$AE$3450,3,FALSE)","v":"Plantes"},"Présence/absence",{"$f":"IF(ISBLANK('4-PLANTES'!$B$26),\"\",'4-PLANTES'!$B$26)","v":""},"in",{"$f":"'Synthese Annuelle Monitoring'!$Q$36","v":0}]
[{"$f":"'0-INFOS GENERALES A REMPLIR'!$B$4","v":2021},{"$f":"'0-INFOS GENERALES A REMPLIR'!$B$6","v":0},{"$f":"'0-INFOS GENERALES A REMPLIR'!$E$12","v":""},null,null,null,{"$f":"IF(ISBLANK('4-PLANTES'!$A27),\"\",'4-PLANTES'!$A27)","v":""},"",{"$f":"IF(ISBLANK('4-PLANTES'!$E$6),\"\",'4-PLANTES'!$E$6)","v":0},{"$f":"IF(ISBLANK('4-PLANTES'!$E$8),\"\",'4-PLANTES'!$E$8)","v":0},null,{"$f":"IF(ISBLANK('4-PLANTES'!$E$12),\"\",'4-PLANTES'!$E$12)","v":""},null,null,{"$f":"IF(ISBLANK('4-PLANTES'!$E$10),\"\",'4-PLANTES'!$E$10)","v":""},null,{"$f":"VLOOKUP('compilation données pour export'!$R169,'listes valeurs'!$AB$2:$AE$3450,2,FALSE)","v":"Silène de nuit"},{"$f":"'4-PLANTES'!$B$17","v":"Silene"},{"$f":"VLOOKUP('compilation données pour export'!$R169,'listes valeurs'!$AB$2:$AE$3450,4,FALSE)","v":"Silene noctiflora"},{"$f":"VLOOKUP('compilation données pour export'!$R169,'listes valeurs'!$AB$2:$AE$3450,3,FALSE)","v":"Plantes"},"Présence/absence",{"$f":"IF(ISBLANK('4-PLANTES'!$B$27),\"\",'4-PLANTES'!$B$27)","v":""},"in",{"$f":"'Synthese Annuelle Monitoring'!$Q$36","v":0}]
[{"$f":"'0-INFOS GENERALES A REMPLIR'!$B$4","v":2021},{"$f":"'0-INFOS GENERALES A REMPLIR'!$B$6","v":0},{"$f":"'0-INFOS GENERALES A REMPLIR'!$E$12","v":""},null,null,null,{"$f":"IF(ISBLANK('4-PLANTES'!$A28),\"\",'4-PLANTES'!$A28)","v":""},"",{"$f":"IF(ISBLANK('4-PLANTES'!$E$6),\"\",'4-PLANTES'!$E$6)","v":0},{"$f":"IF(ISBLANK('4-PLANTES'!$E$8),\"\",'4-PLANTES'!$E$8)","v":0},null,{"$f":"IF(ISBLANK('4-PLANTES'!$E$12),\"\",'4-PLANTES'!$E$12)","v":""},null,null,{"$f":"IF(ISBLANK('4-PLANTES'!$E$10),\"\",'4-PLANTES'!$E$10)","v":""},null,{"$f":"VLOOKUP('compilation données pour export'!$R170,'listes valeurs'!$AB$2:$AE$3450,2,FALSE)","v":"Silène de nuit"},{"$f":"'4-PLANTES'!$B$17","v":"Silene"},{"$f":"VLOOKUP('compilation données pour export'!$R170,'listes valeurs'!$AB$2:$AE$3450,4,FALSE)","v":"Silene noctiflora"},{"$f":"VLOOKUP('compilation données pour export'!$R170,'listes valeurs'!$AB$2:$AE$3450,3,FALSE)","v":"Plantes"},"Présence/absence",{"$f":"IF(ISBLANK('4-PLANTES'!$B$28),\"\",'4-PLANTES'!$B$28)","v":""},"in",{"$f":"'Synthese Annuelle Monitoring'!$Q$36","v":0}]
[{"$f":"'0-INFOS GENERALES A REMPLIR'!$B$4","v":2021},{"$f":"'0-INFOS GENERALES A REMPLIR'!$B$6","v":0},{"$f":"'0-INFOS GENERALES A REMPLIR'!$E$12","v":""},null,null,null,{"$f":"IF(ISBLANK('4-PLANTES'!$A29),\"\",'4-PLANTES'!$A29)","v":""},"",{"$f":"IF(ISBLANK('4-PLANTES'!$E$6),\"\",'4-PLANTES'!$E$6)","v":0},{"$f":"IF(ISBLANK('4-PLANTES'!$E$8),\"\",'4-PLANTES'!$E$8)","v":0},null,{"$f":"IF(ISBLANK('4-PLANTES'!$E$12),\"\",'4-PLANTES'!$E$12)","v":""},null,null,{"$f":"IF(ISBLANK('4-PLANTES'!$E$10),\"\",'4-PLANTES'!$E$10)","v":""},null,{"$f":"VLOOKUP('compilation données pour export'!$R171,'listes valeurs'!$AB$2:$AE$3450,2,FALSE)","v":"Silène de nuit"},{"$f":"'4-PLANTES'!$B$17","v":"Silene"},{"$f":"VLOOKUP('compilation données pour export'!$R171,'listes valeurs'!$AB$2:$AE$3450,4,FALSE)","v":"Silene noctiflora"},{"$f":"VLOOKUP('compilation données pour export'!$R171,'listes valeurs'!$AB$2:$AE$3450,3,FALSE)","v":"Plantes"},"Présence/absence",{"$f":"IF(ISBLANK('4-PLANTES'!$B$29),\"\",'4-PLANTES'!$B$29)","v":""},"in",{"$f":"'Synthese Annuelle Monitoring'!$Q$36","v":0}]
[{"$f":"'0-INFOS GENERALES A REMPLIR'!$B$4","v":2021},{"$f":"'0-INFOS GENERALES A REMPLIR'!$B$6","v":0},{"$f":"'0-INFOS GENERALES A REMPLIR'!$E$12","v":""},null,null,null,{"$f":"IF(ISBLANK('4-PLANTES'!$A30),\"\",'4-PLANTES'!$A30)","v":""},"",{"$f":"IF(ISBLANK('4-PLANTES'!$E$6),\"\",'4-PLANTES'!$E$6)","v":0},{"$f":"IF(ISBLANK('4-PLANTES'!$E$8),\"\",'4-PLANTES'!$E$8)","v":0},null,{"$f":"IF(ISBLANK('4-PLANTES'!$E$12),\"\",'4-PLANTES'!$E$12)","v":""},null,null,{"$f":"IF(ISBLANK('4-PLANTES'!$E$10),\"\",'4-PLANTES'!$E$10)","v":""},null,{"$f":"VLOOKUP('compilation données pour export'!$R172,'listes valeurs'!$AB$2:$AE$3450,2,FALSE)","v":"Silène de nuit"},{"$f":"'4-PLANTES'!$B$17","v":"Silene"},{"$f":"VLOOKUP('compilation données pour export'!$R172,'listes valeurs'!$AB$2:$AE$3450,4,FALSE)","v":"Silene noctiflora"},{"$f":"VLOOKUP('compilation données pour export'!$R172,'listes valeurs'!$AB$2:$AE$3450,3,FALSE)","v":"Plantes"},"Présence/absence",{"$f":"IF(ISBLANK('4-PLANTES'!$B$30),\"\",'4-PLANTES'!$B$30)","v":""},"in",{"$f":"'Synthese Annuelle Monitoring'!$Q$36","v":0}]
[{"$f":"'0-INFOS GENERALES A REMPLIR'!$B$4","v":2021},{"$f":"'0-INFOS GENERALES A REMPLIR'!$B$6","v":0},{"$f":"'0-INFOS GENERALES A REMPLIR'!$E$12","v":""},null,null,null,{"$f":"IF(ISBLANK('4-PLANTES'!$A31),\"\",'4-PLANTES'!$A31)","v":""},"",{"$f":"IF(ISBLANK('4-PLANTES'!$E$6),\"\",'4-PLANTES'!$E$6)","v":0},{"$f":"IF(ISBLANK('4-PLANTES'!$E$8),\"\",'4-PLANTES'!$E$8)","v":0},null,{"$f":"IF(ISBLANK('4-PLANTES'!$E$12),\"\",'4-PLANTES'!$E$12)","v":""},null,null,{"$f":"IF(ISBLANK('4-PLANTES'!$E$10),\"\",'4-PLANTES'!$E$10)","v":""},null,{"$f":"VLOOKUP('compilation données pour export'!$R173,'listes valeurs'!$AB$2:$AE$3450,2,FALSE)","v":"Silène de nuit"},{"$f":"'4-PLANTES'!$B$17","v":"Silene"},{"$f":"VLOOKUP('compilation données pour export'!$R173,'listes valeurs'!$AB$2:$AE$3450,4,FALSE)","v":"Silene noctiflora"},{"$f":"VLOOKUP('compilation données pour export'!$R173,'listes valeurs'!$AB$2:$AE$3450,3,FALSE)","v":"Plantes"},"Présence/absence",{"$f":"IF(ISBLANK('4-PLANTES'!$B$31),\"\",'4-PLANTES'!$B$31)","v":""},"in",{"$f":"'Synthese Annuelle Monitoring'!$Q$36","v":0}]
[{"$f":"'0-INFOS GENERALES A REMPLIR'!$B$4","v":2021},{"$f":"'0-INFOS GENERALES A REMPLIR'!$B$6","v":0},{"$f":"'0-INFOS GENERALES A REMPLIR'!$E$12","v":""},null,null,null,{"$f":"IF(ISBLANK('4-PLANTES'!$A32),\"\",'4-PLANTES'!$A32)","v":""},"",{"$f":"IF(ISBLANK('4-PLANTES'!$E$6),\"\",'4-PLANTES'!$E$6)","v":0},{"$f":"IF(ISBLANK('4-PLANTES'!$E$8),\"\",'4-PLANTES'!$E$8)","v":0},null,{"$f":"IF(ISBLANK('4-PLANTES'!$E$12),\"\",'4-PLANTES'!$E$12)","v":""},null,null,{"$f":"IF(ISBLANK('4-PLANTES'!$E$10),\"\",'4-PLANTES'!$E$10)","v":""},null,{"$f":"VLOOKUP('compilation données pour export'!$R174,'listes valeurs'!$AB$2:$AE$3450,2,FALSE)","v":"Silène de nuit"},{"$f":"'4-PLANTES'!$B$17","v":"Silene"},{"$f":"VLOOKUP('compilation données pour export'!$R174,'listes valeurs'!$AB$2:$AE$3450,4,FALSE)","v":"Silene noctiflora"},{"$f":"VLOOKUP('compilation données pour export'!$R174,'listes valeurs'!$AB$2:$AE$3450,3,FALSE)","v":"Plantes"},"Présence/absence",{"$f":"IF(ISBLANK('4-PLANTES'!$B$32),\"\",'4-PLANTES'!$B$32)","v":""},"in",{"$f":"'Synthese Annuelle Monitoring'!$Q$36","v":0}]
[{"$f":"'0-INFOS GENERALES A REMPLIR'!$B$4","v":2021},{"$f":"'0-INFOS GENERALES A REMPLIR'!$B$6","v":0},{"$f":"'0-INFOS GENERALES A REMPLIR'!$E$12","v":""},null,null,null,null,"",{"$f":"IF(ISBLANK('4-PLANTES'!$E$6),\"\",'4-PLANTES'!$E$6)","v":0},{"$f":"IF(ISBLANK('4-PLANTES'!$E$8),\"\",'4-PLANTES'!$E$8)","v":0},null,{"$f":"IF(ISBLANK('4-PLANTES'!$E$12),\"\",'4-PLANTES'!$E$12)","v":""},null,null,{"$f":"IF(ISBLANK('4-PLANTES'!$E$10),\"\",'4-PLANTES'!$E$10)","v":""},null,{"$f":"VLOOKUP('compilation données pour export'!$R175,'listes valeurs'!$AB$2:$AE$3450,2,FALSE)","v":"Silène de nuit"},{"$f":"'4-PLANTES'!$B$17","v":"Silene"},{"$f":"VLOOKUP('compilation données pour export'!$R175,'listes valeurs'!$AB$2:$AE$3450,4,FALSE)","v":"Silene noctiflora"},{"$f":"VLOOKUP('compilation données pour export'!$R175,'listes valeurs'!$AB$2:$AE$3450,3,FALSE)","v":"Plantes"},"Présence/absence",{"$f":"IF(ISBLANK('4-PLANTES'!$B$35),\"\",IF('4-PLANTES'!$B$35=\"non\",0,IF('4-PLANTES'!$B$35=\"oui\",1,\"erreur de saisie\")))","v":""},"out",{"$f":"'Synthese Annuelle Monitoring'!$Q$36","v":0}]
[{"$f":"'0-INFOS GENERALES A REMPLIR'!$B$4","v":2021},{"$f":"'0-INFOS GENERALES A REMPLIR'!$B$6","v":0},{"$f":"'0-INFOS GENERALES A REMPLIR'!$E$12","v":""},null,null,null,null,"",{"$f":"IF(ISBLANK('4-PLANTES'!$E$6),\"\",'4-PLANTES'!$E$6)","v":0},{"$f":"IF(ISBLANK('4-PLANTES'!$E$8),\"\",'4-PLANTES'!$E$8)","v":0},null,{"$f":"IF(ISBLANK('4-PLANTES'!$E$12),\"\",'4-PLANTES'!$E$12)","v":""},null,null,{"$f":"IF(ISBLANK('4-PLANTES'!$E$10),\"\",'4-PLANTES'!$E$10)","v":""},null,{"$f":"VLOOKUP('compilation données pour export'!$R176,'listes valeurs'!$AB$2:$AE$3450,2,FALSE)","v":"Silène de nuit"},{"$f":"'4-PLANTES'!$B$17","v":"Silene"},{"$f":"VLOOKUP('compilation données pour export'!$R176,'listes valeurs'!$AB$2:$AE$3450,4,FALSE)","v":"Silene noctiflora"},{"$f":"VLOOKUP('compilation données pour export'!$R176,'listes valeurs'!$AB$2:$AE$3450,3,FALSE)","v":"Plantes"},"Nb parcelles SPB positives",{"$f":"IF('4-PLANTES'!$B$33=0,\"\",'4-PLANTES'!$B$33)","v":""},"in",{"$f":"'Synthese Annuelle Monitoring'!$Q$36","v":0}]
[{"$f":"'0-INFOS GENERALES A REMPLIR'!$B$4","v":2021},{"$f":"'0-INFOS GENERALES A REMPLIR'!$B$6","v":0},{"$f":"'0-INFOS GENERALES A REMPLIR'!$E$12","v":""},null,null,null,null,"",{"$f":"IF(ISBLANK('4-PLANTES'!$E$6),\"\",'4-PLANTES'!$E$6)","v":0},{"$f":"IF(ISBLANK('4-PLANTES'!$E$8),\"\",'4-PLANTES'!$E$8)","v":0},null,{"$f":"IF(ISBLANK('4-PLANTES'!$E$12),\"\",'4-PLANTES'!$E$12)","v":""},null,null,{"$f":"IF(ISBLANK('4-PLANTES'!$E$10),\"\",'4-PLANTES'!$E$10)","v":""},null,{"$f":"VLOOKUP('compilation données pour export'!$R177,'listes valeurs'!$AB$2:$AE$3450,2,FALSE)","v":"Silène de nuit"},{"$f":"'4-PLANTES'!$B$17","v":"Silene"},{"$f":"VLOOKUP('compilation données pour export'!$R177,'listes valeurs'!$AB$2:$AE$3450,4,FALSE)","v":"Silene noctiflora"},{"$f":"VLOOKUP('compilation données pour export'!$R177,'listes valeurs'!$AB$2:$AE$3450,3,FALSE)","v":"Plantes"},"% présence dans SPB * ",{"$f":"IF('4-PLANTES'!$B$33=0,\"\",COUNTIF(V160:V174,1)/COUNTIF(V160:V174,\">-1\"))","v":""},"in",{"$f":"'Synthese Annuelle Monitoring'!$Q$36","v":0}]
[{"$f":"'0-INFOS GENERALES A REMPLIR'!$B$4","v":2021},{"$f":"'0-INFOS GENERALES A REMPLIR'!$B$6","v":0},{"$f":"'0-INFOS GENERALES A REMPLIR'!$E$12","v":""},null,null,null,{"$f":"IF(ISBLANK('4-PLANTES'!$A$18),\"\",'4-PLANTES'!$A$18)","v":""},"",{"$f":"IF(ISBLANK('4-PLANTES'!$E$6),\"\",'4-PLANTES'!$E$6)","v":0},{"$f":"IF(ISBLANK('4-PLANTES'!$E$8),\"\",'4-PLANTES'!$E$8)","v":0},null,{"$f":"IF(ISBLANK('4-PLANTES'!$E$12),\"\",'4-PLANTES'!$E$12)","v":""},null,null,{"$f":"IF(ISBLANK('4-PLANTES'!$E$10),\"\",'4-PLANTES'!$E$10)","v":""},null,{"$f":"VLOOKUP('compilation données pour export'!$R178,'listes valeurs'!$AB$2:$AE$3450,2,FALSE)","v":"Linaire bâtarde"},{"$f":"'4-PLANTES'!$C$17","v":"Kickxia"},{"$f":"VLOOKUP('compilation données pour export'!$R178,'listes valeurs'!$AB$2:$AE$3450,4,FALSE)","v":"Kickxia spuria"},{"$f":"VLOOKUP('compilation données pour export'!$R178,'listes valeurs'!$AB$2:$AE$3450,3,FALSE)","v":"Plantes"},"Présence/absence",{"$f":"IF(ISBLANK('4-PLANTES'!$C$18),\"\",'4-PLANTES'!$C$18)","v":""},"in",{"$f":"'Synthese Annuelle Monitoring'!$Q$37","v":0}]
[{"$f":"'0-INFOS GENERALES A REMPLIR'!$B$4","v":2021},{"$f":"'0-INFOS GENERALES A REMPLIR'!$B$6","v":0},{"$f":"'0-INFOS GENERALES A REMPLIR'!$E$12","v":""},null,null,null,{"$f":"IF(ISBLANK('4-PLANTES'!$A$19),\"\",'4-PLANTES'!$A$19)","v":""},"",{"$f":"IF(ISBLANK('4-PLANTES'!$E$6),\"\",'4-PLANTES'!$E$6)","v":0},{"$f":"IF(ISBLANK('4-PLANTES'!$E$8),\"\",'4-PLANTES'!$E$8)","v":0},null,{"$f":"IF(ISBLANK('4-PLANTES'!$E$12),\"\",'4-PLANTES'!$E$12)","v":""},null,null,{"$f":"IF(ISBLANK('4-PLANTES'!$E$10),\"\",'4-PLANTES'!$E$10)","v":""},null,{"$f":"VLOOKUP('compilation données pour export'!$R179,'listes valeurs'!$AB$2:$AE$3450,2,FALSE)","v":"Linaire bâtarde"},{"$f":"'4-PLANTES'!$C$17","v":"Kickxia"},{"$f":"VLOOKUP('compilation données pour export'!$R179,'listes valeurs'!$AB$2:$AE$3450,4,FALSE)","v":"Kickxia spuria"},{"$f":"VLOOKUP('compilation données pour export'!$R179,'listes valeurs'!$AB$2:$AE$3450,3,FALSE)","v":"Plantes"},"Présence/absence",{"$f":"IF(ISBLANK('4-PLANTES'!$C$19),\"\",'4-PLANTES'!$C$19)","v":""},"in",{"$f":"'Synthese Annuelle Monitoring'!$Q$37","v":0}]
[{"$f":"'0-INFOS GENERALES A REMPLIR'!$B$4","v":2021},{"$f":"'0-INFOS GENERALES A REMPLIR'!$B$6","v":0},{"$f":"'0-INFOS GENERALES A REMPLIR'!$E$12","v":""},null,null,null,{"$f":"IF(ISBLANK('4-PLANTES'!$A$20),\"\",'4-PLANTES'!$A$20)","v":""},"",{"$f":"IF(ISBLANK('4-PLANTES'!$E$6),\"\",'4-PLANTES'!$E$6)","v":0},{"$f":"IF(ISBLANK('4-PLANTES'!$E$8),\"\",'4-PLANTES'!$E$8)","v":0},null,{"$f":"IF(ISBLANK('4-PLANTES'!$E$12),\"\",'4-PLANTES'!$E$12)","v":""},null,null,{"$f":"IF(ISBLANK('4-PLANTES'!$E$10),\"\",'4-PLANTES'!$E$10)","v":""},null,{"$f":"VLOOKUP('compilation données pour export'!$R180,'listes valeurs'!$AB$2:$AE$3450,2,FALSE)","v":"Linaire bâtarde"},{"$f":"'4-PLANTES'!$C$17","v":"Kickxia"},{"$f":"VLOOKUP('compilation données pour export'!$R180,'listes valeurs'!$AB$2:$AE$3450,4,FALSE)","v":"Kickxia spuria"},{"$f":"VLOOKUP('compilation données pour export'!$R180,'listes valeurs'!$AB$2:$AE$3450,3,FALSE)","v":"Plantes"},"Présence/absence",{"$f":"IF(ISBLANK('4-PLANTES'!$C$20),\"\",'4-PLANTES'!$C$20)","v":""},"in",{"$f":"'Synthese Annuelle Monitoring'!$Q$37","v":0}]
[{"$f":"'0-INFOS GENERALES A REMPLIR'!$B$4","v":2021},{"$f":"'0-INFOS GENERALES A REMPLIR'!$B$6","v":0},{"$f":"'0-INFOS GENERALES A REMPLIR'!$E$12","v":""},null,null,null,{"$f":"IF(ISBLANK('4-PLANTES'!$A$21),\"\",'4-PLANTES'!$A$21)","v":""},"",{"$f":"IF(ISBLANK('4-PLANTES'!$E$6),\"\",'4-PLANTES'!$E$6)","v":0},{"$f":"IF(ISBLANK('4-PLANTES'!$E$8),\"\",'4-PLANTES'!$E$8)","v":0},null,{"$f":"IF(ISBLANK('4-PLANTES'!$E$12),\"\",'4-PLANTES'!$E$12)","v":""},null,null,{"$f":"IF(ISBLANK('4-PLANTES'!$E$10),\"\",'4-PLANTES'!$E$10)","v":""},null,{"$f":"VLOOKUP('compilation données pour export'!$R181,'listes valeurs'!$AB$2:$AE$3450,2,FALSE)","v":"Linaire bâtarde"},{"$f":"'4-PLANTES'!$C$17","v":"Kickxia"},{"$f":"VLOOKUP('compilation données pour export'!$R181,'listes valeurs'!$AB$2:$AE$3450,4,FALSE)","v":"Kickxia spuria"},{"$f":"VLOOKUP('compilation données pour export'!$R181,'listes valeurs'!$AB$2:$AE$3450,3,FALSE)","v":"Plantes"},"Présence/absence",{"$f":"IF(ISBLANK('4-PLANTES'!$C$21),\"\",'4-PLANTES'!$C$21)","v":""},"in",{"$f":"'Synthese Annuelle Monitoring'!$Q$37","v":0}]
[{"$f":"'0-INFOS GENERALES A REMPLIR'!$B$4","v":2021},{"$f":"'0-INFOS GENERALES A REMPLIR'!$B$6","v":0},{"$f":"'0-INFOS GENERALES A REMPLIR'!$E$12","v":""},null,null,null,{"$f":"IF(ISBLANK('4-PLANTES'!$A$22),\"\",'4-PLANTES'!$A$22)","v":""},"",{"$f":"IF(ISBLANK('4-PLANTES'!$E$6),\"\",'4-PLANTES'!$E$6)","v":0},{"$f":"IF(ISBLANK('4-PLANTES'!$E$8),\"\",'4-PLANTES'!$E$8)","v":0},null,{"$f":"IF(ISBLANK('4-PLANTES'!$E$12),\"\",'4-PLANTES'!$E$12)","v":""},null,null,{"$f":"IF(ISBLANK('4-PLANTES'!$E$10),\"\",'4-PLANTES'!$E$10)","v":""},null,{"$f":"VLOOKUP('compilation données pour export'!$R182,'listes valeurs'!$AB$2:$AE$3450,2,FALSE)","v":"Linaire bâtarde"},{"$f":"'4-PLANTES'!$C$17","v":"Kickxia"},{"$f":"VLOOKUP('compilation données pour export'!$R182,'listes valeurs'!$AB$2:$AE$3450,4,FALSE)","v":"Kickxia spuria"},{"$f":"VLOOKUP('compilation données pour export'!$R182,'listes valeurs'!$AB$2:$AE$3450,3,FALSE)","v":"Plantes"},"Présence/absence",{"$f":"IF(ISBLANK('4-PLANTES'!$C$22),\"\",'4-PLANTES'!$C$22)","v":""},"in",{"$f":"'Synthese Annuelle Monitoring'!$Q$37","v":0}]
[{"$f":"'0-INFOS GENERALES A REMPLIR'!$B$4","v":2021},{"$f":"'0-INFOS GENERALES A REMPLIR'!$B$6","v":0},{"$f":"'0-INFOS GENERALES A REMPLIR'!$E$12","v":""},null,null,null,{"$f":"IF(ISBLANK('4-PLANTES'!$A$23),\"\",'4-PLANTES'!$A$23)","v":""},"",{"$f":"IF(ISBLANK('4-PLANTES'!$E$6),\"\",'4-PLANTES'!$E$6)","v":0},{"$f":"IF(ISBLANK('4-PLANTES'!$E$8),\"\",'4-PLANTES'!$E$8)","v":0},null,{"$f":"IF(ISBLANK('4-PLANTES'!$E$12),\"\",'4-PLANTES'!$E$12)","v":""},null,null,{"$f":"IF(ISBLANK('4-PLANTES'!$E$10),\"\",'4-PLANTES'!$E$10)","v":""},null,{"$f":"VLOOKUP('compilation données pour export'!$R183,'listes valeurs'!$AB$2:$AE$3450,2,FALSE)","v":"Linaire bâtarde"},{"$f":"'4-PLANTES'!$C$17","v":"Kickxia"},{"$f":"VLOOKUP('compilation données pour export'!$R183,'listes valeurs'!$AB$2:$AE$3450,4,FALSE)","v":"Kickxia spuria"},{"$f":"VLOOKUP('compilation données pour export'!$R183,'listes valeurs'!$AB$2:$AE$3450,3,FALSE)","v":"Plantes"},"Présence/absence",{"$f":"IF(ISBLANK('4-PLANTES'!$C$23),\"\",'4-PLANTES'!$C$23)","v":""},"in",{"$f":"'Synthese Annuelle Monitoring'!$Q$37","v":0}]
[{"$f":"'0-INFOS GENERALES A REMPLIR'!$B$4","v":2021},{"$f":"'0-INFOS GENERALES A REMPLIR'!$B$6","v":0},{"$f":"'0-INFOS GENERALES A REMPLIR'!$E$12","v":""},null,null,null,{"$f":"IF(ISBLANK('4-PLANTES'!$A$24),\"\",'4-PLANTES'!$A$24)","v":""},"",{"$f":"IF(ISBLANK('4-PLANTES'!$E$6),\"\",'4-PLANTES'!$E$6)","v":0},{"$f":"IF(ISBLANK('4-PLANTES'!$E$8),\"\",'4-PLANTES'!$E$8)","v":0},null,{"$f":"IF(ISBLANK('4-PLANTES'!$E$12),\"\",'4-PLANTES'!$E$12)","v":""},null,null,{"$f":"IF(ISBLANK('4-PLANTES'!$E$10),\"\",'4-PLANTES'!$E$10)","v":""},null,{"$f":"VLOOKUP('compilation données pour export'!$R184,'listes valeurs'!$AB$2:$AE$3450,2,FALSE)","v":"Linaire bâtarde"},{"$f":"'4-PLANTES'!$C$17","v":"Kickxia"},{"$f":"VLOOKUP('compilation données pour export'!$R184,'listes valeurs'!$AB$2:$AE$3450,4,FALSE)","v":"Kickxia spuria"},{"$f":"VLOOKUP('compilation données pour export'!$R184,'listes valeurs'!$AB$2:$AE$3450,3,FALSE)","v":"Plantes"},"Présence/absence",{"$f":"IF(ISBLANK('4-PLANTES'!$C$24),\"\",'4-PLANTES'!$C$24)","v":""},"in",{"$f":"'Synthese Annuelle Monitoring'!$Q$37","v":0}]
[{"$f":"'0-INFOS GENERALES A REMPLIR'!$B$4","v":2021},{"$f":"'0-INFOS GENERALES A REMPLIR'!$B$6","v":0},{"$f":"'0-INFOS GENERALES A REMPLIR'!$E$12","v":""},null,null,null,{"$f":"IF(ISBLANK('4-PLANTES'!$A$25),\"\",'4-PLANTES'!$A$25)","v":""},"",{"$f":"IF(ISBLANK('4-PLANTES'!$E$6),\"\",'4-PLANTES'!$E$6)","v":0},{"$f":"IF(ISBLANK('4-PLANTES'!$E$8),\"\",'4-PLANTES'!$E$8)","v":0},null,{"$f":"IF(ISBLANK('4-PLANTES'!$E$12),\"\",'4-PLANTES'!$E$12)","v":""},null,null,{"$f":"IF(ISBLANK('4-PLANTES'!$E$10),\"\",'4-PLANTES'!$E$10)","v":""},null,{"$f":"VLOOKUP('compilation données pour export'!$R185,'listes valeurs'!$AB$2:$AE$3450,2,FALSE)","v":"Linaire bâtarde"},{"$f":"'4-PLANTES'!$C$17","v":"Kickxia"},{"$f":"VLOOKUP('compilation données pour export'!$R185,'listes valeurs'!$AB$2:$AE$3450,4,FALSE)","v":"Kickxia spuria"},{"$f":"VLOOKUP('compilation données pour export'!$R185,'listes valeurs'!$AB$2:$AE$3450,3,FALSE)","v":"Plantes"},"Présence/absence",{"$f":"IF(ISBLANK('4-PLANTES'!$C$25),\"\",'4-PLANTES'!$C$25)","v":""},"in",{"$f":"'Synthese Annuelle Monitoring'!$Q$37","v":0}]
[{"$f":"'0-INFOS GENERALES A REMPLIR'!$B$4","v":2021},{"$f":"'0-INFOS GENERALES A REMPLIR'!$B$6","v":0},{"$f":"'0-INFOS GENERALES A REMPLIR'!$E$12","v":""},null,null,null,{"$f":"IF(ISBLANK('4-PLANTES'!$A$26),\"\",'4-PLANTES'!$A$26)","v":""},"",{"$f":"IF(ISBLANK('4-PLANTES'!$E$6),\"\",'4-PLANTES'!$E$6)","v":0},{"$f":"IF(ISBLANK('4-PLANTES'!$E$8),\"\",'4-PLANTES'!$E$8)","v":0},null,{"$f":"IF(ISBLANK('4-PLANTES'!$E$12),\"\",'4-PLANTES'!$E$12)","v":""},null,null,{"$f":"IF(ISBLANK('4-PLANTES'!$E$10),\"\",'4-PLANTES'!$E$10)","v":""},null,{"$f":"VLOOKUP('compilation données pour export'!$R186,'listes valeurs'!$AB$2:$AE$3450,2,FALSE)","v":"Linaire bâtarde"},{"$f":"'4-PLANTES'!$C$17","v":"Kickxia"},{"$f":"VLOOKUP('compilation données pour export'!$R186,'listes valeurs'!$AB$2:$AE$3450,4,FALSE)","v":"Kickxia spuria"},{"$f":"VLOOKUP('compilation données pour export'!$R186,'listes valeurs'!$AB$2:$AE$3450,3,FALSE)","v":"Plantes"},"Présence/absence",{"$f":"IF(ISBLANK('4-PLANTES'!$C$26),\"\",'4-PLANTES'!$C$26)","v":""},"in",{"$f":"'Synthese Annuelle Monitoring'!$Q$37","v":0}]
[{"$f":"'0-INFOS GENERALES A REMPLIR'!$B$4","v":2021},{"$f":"'0-INFOS GENERALES A REMPLIR'!$B$6","v":0},{"$f":"'0-INFOS GENERALES A REMPLIR'!$E$12","v":""},null,null,null,{"$f":"IF(ISBLANK('4-PLANTES'!$A$27),\"\",'4-PLANTES'!$A$27)","v":""},"",{"$f":"IF(ISBLANK('4-PLANTES'!$E$6),\"\",'4-PLANTES'!$E$6)","v":0},{"$f":"IF(ISBLANK('4-PLANTES'!$E$8),\"\",'4-PLANTES'!$E$8)","v":0},null,{"$f":"IF(ISBLANK('4-PLANTES'!$E$12),\"\",'4-PLANTES'!$E$12)","v":""},null,null,{"$f":"IF(ISBLANK('4-PLANTES'!$E$10),\"\",'4-PLANTES'!$E$10)","v":""},null,{"$f":"VLOOKUP('compilation données pour export'!$R187,'listes valeurs'!$AB$2:$AE$3450,2,FALSE)","v":"Linaire bâtarde"},{"$f":"'4-PLANTES'!$C$17","v":"Kickxia"},{"$f":"VLOOKUP('compilation données pour export'!$R187,'listes valeurs'!$AB$2:$AE$3450,4,FALSE)","v":"Kickxia spuria"},{"$f":"VLOOKUP('compilation données pour export'!$R187,'listes valeurs'!$AB$2:$AE$3450,3,FALSE)","v":"Plantes"},"Présence/absence",{"$f":"IF(ISBLANK('4-PLANTES'!$C$27),\"\",'4-PLANTES'!$C$27)","v":""},"in",{"$f":"'Synthese Annuelle Monitoring'!$Q$37","v":0}]
[{"$f":"'0-INFOS GENERALES A REMPLIR'!$B$4","v":2021},{"$f":"'0-INFOS GENERALES A REMPLIR'!$B$6","v":0},{"$f":"'0-INFOS GENERALES A REMPLIR'!$E$12","v":""},null,null,null,{"$f":"IF(ISBLANK('4-PLANTES'!$A$28),\"\",'4-PLANTES'!$A$28)","v":""},"",{"$f":"IF(ISBLANK('4-PLANTES'!$E$6),\"\",'4-PLANTES'!$E$6)","v":0},{"$f":"IF(ISBLANK('4-PLANTES'!$E$8),\"\",'4-PLANTES'!$E$8)","v":0},null,{"$f":"IF(ISBLANK('4-PLANTES'!$E$12),\"\",'4-PLANTES'!$E$12)","v":""},null,null,{"$f":"IF(ISBLANK('4-PLANTES'!$E$10),\"\",'4-PLANTES'!$E$10)","v":""},null,{"$f":"VLOOKUP('compilation données pour export'!$R188,'listes valeurs'!$AB$2:$AE$3450,2,FALSE)","v":"Linaire bâtarde"},{"$f":"'4-PLANTES'!$C$17","v":"Kickxia"},{"$f":"VLOOKUP('compilation données pour export'!$R188,'listes valeurs'!$AB$2:$AE$3450,4,FALSE)","v":"Kickxia spuria"},{"$f":"VLOOKUP('compilation données pour export'!$R188,'listes valeurs'!$AB$2:$AE$3450,3,FALSE)","v":"Plantes"},"Présence/absence",{"$f":"IF(ISBLANK('4-PLANTES'!$C$28),\"\",'4-PLANTES'!$C$28)","v":""},"in",{"$f":"'Synthese Annuelle Monitoring'!$Q$37","v":0}]
[{"$f":"'0-INFOS GENERALES A REMPLIR'!$B$4","v":2021},{"$f":"'0-INFOS GENERALES A REMPLIR'!$B$6","v":0},{"$f":"'0-INFOS GENERALES A REMPLIR'!$E$12","v":""},null,null,null,{"$f":"IF(ISBLANK('4-PLANTES'!$A$29),\"\",'4-PLANTES'!$A$29)","v":""},"",{"$f":"IF(ISBLANK('4-PLANTES'!$E$6),\"\",'4-PLANTES'!$E$6)","v":0},{"$f":"IF(ISBLANK('4-PLANTES'!$E$8),\"\",'4-PLANTES'!$E$8)","v":0},null,{"$f":"IF(ISBLANK('4-PLANTES'!$E$12),\"\",'4-PLANTES'!$E$12)","v":""},null,null,{"$f":"IF(ISBLANK('4-PLANTES'!$E$10),\"\",'4-PLANTES'!$E$10)","v":""},null,{"$f":"VLOOKUP('compilation données pour export'!$R189,'listes valeurs'!$AB$2:$AE$3450,2,FALSE)","v":"Linaire bâtarde"},{"$f":"'4-PLANTES'!$C$17","v":"Kickxia"},{"$f":"VLOOKUP('compilation données pour export'!$R189,'listes valeurs'!$AB$2:$AE$3450,4,FALSE)","v":"Kickxia spuria"},{"$f":"VLOOKUP('compilation données pour export'!$R189,'listes valeurs'!$AB$2:$AE$3450,3,FALSE)","v":"Plantes"},"Présence/absence",{"$f":"IF(ISBLANK('4-PLANTES'!$C$29),\"\",'4-PLANTES'!$C$29)","v":""},"in",{"$f":"'Synthese Annuelle Monitoring'!$Q$37","v":0}]
[{"$f":"'0-INFOS GENERALES A REMPLIR'!$B$4","v":2021},{"$f":"'0-INFOS GENERALES A REMPLIR'!$B$6","v":0},{"$f":"'0-INFOS GENERALES A REMPLIR'!$E$12","v":""},null,null,null,{"$f":"IF(ISBLANK('4-PLANTES'!$A$30),\"\",'4-PLANTES'!$A$30)","v":""},"",{"$f":"IF(ISBLANK('4-PLANTES'!$E$6),\"\",'4-PLANTES'!$E$6)","v":0},{"$f":"IF(ISBLANK('4-PLANTES'!$E$8),\"\",'4-PLANTES'!$E$8)","v":0},null,{"$f":"IF(ISBLANK('4-PLANTES'!$E$12),\"\",'4-PLANTES'!$E$12)","v":""},null,null,{"$f":"IF(ISBLANK('4-PLANTES'!$E$10),\"\",'4-PLANTES'!$E$10)","v":""},null,{"$f":"VLOOKUP('compilation données pour export'!$R190,'listes valeurs'!$AB$2:$AE$3450,2,FALSE)","v":"Linaire bâtarde"},{"$f":"'4-PLANTES'!$C$17","v":"Kickxia"},{"$f":"VLOOKUP('compilation données pour export'!$R190,'listes valeurs'!$AB$2:$AE$3450,4,FALSE)","v":"Kickxia spuria"},{"$f":"VLOOKUP('compilation données pour export'!$R190,'listes valeurs'!$AB$2:$AE$3450,3,FALSE)","v":"Plantes"},"Présence/absence",{"$f":"IF(ISBLANK('4-PLANTES'!$C$30),\"\",'4-PLANTES'!$C$30)","v":""},"in",{"$f":"'Synthese Annuelle Monitoring'!$Q$37","v":0}]
[{"$f":"'0-INFOS GENERALES A REMPLIR'!$B$4","v":2021},{"$f":"'0-INFOS GENERALES A REMPLIR'!$B$6","v":0},{"$f":"'0-INFOS GENERALES A REMPLIR'!$E$12","v":""},null,null,null,{"$f":"IF(ISBLANK('4-PLANTES'!$A$31),\"\",'4-PLANTES'!$A$31)","v":""},"",{"$f":"IF(ISBLANK('4-PLANTES'!$E$6),\"\",'4-PLANTES'!$E$6)","v":0},{"$f":"IF(ISBLANK('4-PLANTES'!$E$8),\"\",'4-PLANTES'!$E$8)","v":0},null,{"$f":"IF(ISBLANK('4-PLANTES'!$E$12),\"\",'4-PLANTES'!$E$12)","v":""},null,null,{"$f":"IF(ISBLANK('4-PLANTES'!$E$10),\"\",'4-PLANTES'!$E$10)","v":""},null,{"$f":"VLOOKUP('compilation données pour export'!$R191,'listes valeurs'!$AB$2:$AE$3450,2,FALSE)","v":"Linaire bâtarde"},{"$f":"'4-PLANTES'!$C$17","v":"Kickxia"},{"$f":"VLOOKUP('compilation données pour export'!$R191,'listes valeurs'!$AB$2:$AE$3450,4,FALSE)","v":"Kickxia spuria"},{"$f":"VLOOKUP('compilation données pour export'!$R191,'listes valeurs'!$AB$2:$AE$3450,3,FALSE)","v":"Plantes"},"Présence/absence",{"$f":"IF(ISBLANK('4-PLANTES'!$C$31),\"\",'4-PLANTES'!$C$31)","v":""},"in",{"$f":"'Synthese Annuelle Monitoring'!$Q$37","v":0}]
[{"$f":"'0-INFOS GENERALES A REMPLIR'!$B$4","v":2021},{"$f":"'0-INFOS GENERALES A REMPLIR'!$B$6","v":0},{"$f":"'0-INFOS GENERALES A REMPLIR'!$E$12","v":""},null,null,null,{"$f":"IF(ISBLANK('4-PLANTES'!$A$32),\"\",'4-PLANTES'!$A$32)","v":""},"",{"$f":"IF(ISBLANK('4-PLANTES'!$E$6),\"\",'4-PLANTES'!$E$6)","v":0},{"$f":"IF(ISBLANK('4-PLANTES'!$E$8),\"\",'4-PLANTES'!$E$8)","v":0},null,{"$f":"IF(ISBLANK('4-PLANTES'!$E$12),\"\",'4-PLANTES'!$E$12)","v":""},null,null,{"$f":"IF(ISBLANK('4-PLANTES'!$E$10),\"\",'4-PLANTES'!$E$10)","v":""},null,{"$f":"VLOOKUP('compilation données pour export'!$R192,'listes valeurs'!$AB$2:$AE$3450,2,FALSE)","v":"Linaire bâtarde"},{"$f":"'4-PLANTES'!$C$17","v":"Kickxia"},{"$f":"VLOOKUP('compilation données pour export'!$R192,'listes valeurs'!$AB$2:$AE$3450,4,FALSE)","v":"Kickxia spuria"},{"$f":"VLOOKUP('compilation données pour export'!$R192,'listes valeurs'!$AB$2:$AE$3450,3,FALSE)","v":"Plantes"},"Présence/absence",{"$f":"IF(ISBLANK('4-PLANTES'!$C$32),\"\",'4-PLANTES'!$C$32)","v":""},"in",{"$f":"'Synthese Annuelle Monitoring'!$Q$37","v":0}]
[{"$f":"'0-INFOS GENERALES A REMPLIR'!$B$4","v":2021},{"$f":"'0-INFOS GENERALES A REMPLIR'!$B$6","v":0},{"$f":"'0-INFOS GENERALES A REMPLIR'!$E$12","v":""},null,null,null,null,null,{"$f":"IF(ISBLANK('4-PLANTES'!$E$6),\"\",'4-PLANTES'!$E$6)","v":0},{"$f":"IF(ISBLANK('4-PLANTES'!$E$8),\"\",'4-PLANTES'!$E$8)","v":0},null,{"$f":"IF(ISBLANK('4-PLANTES'!$E$12),\"\",'4-PLANTES'!$E$12)","v":""},null,null,{"$f":"IF(ISBLANK('4-PLANTES'!$E$10),\"\",'4-PLANTES'!$E$10)","v":""},null,{"$f":"VLOOKUP('compilation données pour export'!$R193,'listes valeurs'!$AB$2:$AE$3450,2,FALSE)","v":"Linaire bâtarde"},{"$f":"'4-PLANTES'!$C$17","v":"Kickxia"},{"$f":"VLOOKUP('compilation données pour export'!$R193,'listes valeurs'!$AB$2:$AE$3450,4,FALSE)","v":"Kickxia spuria"},{"$f":"VLOOKUP('compilation données pour export'!$R193,'listes valeurs'!$AB$2:$AE$3450,3,FALSE)","v":"Plantes"},"Présence/absence",{"$f":"IF(ISBLANK('4-PLANTES'!$C$35),\"\",IF('4-PLANTES'!$C$35=\"non\",0,IF('4-PLANTES'!$C$35=\"oui\",1,\"erreur de saisie\")))","v":""},"out",{"$f":"'Synthese Annuelle Monitoring'!$Q$37","v":0}]
[{"$f":"'0-INFOS GENERALES A REMPLIR'!$B$4","v":2021},{"$f":"'0-INFOS GENERALES A REMPLIR'!$B$6","v":0},{"$f":"'0-INFOS GENERALES A REMPLIR'!$E$12","v":""},null,null,null,null,null,{"$f":"IF(ISBLANK('4-PLANTES'!$E$6),\"\",'4-PLANTES'!$E$6)","v":0},{"$f":"IF(ISBLANK('4-PLANTES'!$E$8),\"\",'4-PLANTES'!$E$8)","v":0},null,{"$f":"IF(ISBLANK('4-PLANTES'!$E$12),\"\",'4-PLANTES'!$E$12)","v":""},null,null,{"$f":"IF(ISBLANK('4-PLANTES'!$E$10),\"\",'4-PLANTES'!$E$10)","v":""},null,{"$f":"VLOOKUP('compilation données pour export'!$R194,'listes valeurs'!$AB$2:$AE$3450,2,FALSE)","v":"Linaire bâtarde"},{"$f":"'4-PLANTES'!$C$17","v":"Kickxia"},{"$f":"VLOOKUP('compilation données pour export'!$R194,'listes valeurs'!$AB$2:$AE$3450,4,FALSE)","v":"Kickxia spuria"},{"$f":"VLOOKUP('compilation données pour export'!$R194,'listes valeurs'!$AB$2:$AE$3450,3,FALSE)","v":"Plantes"},"Nb parcelles SPB positives",{"$f":"IF('4-PLANTES'!$C$33=0,\"\",'4-PLANTES'!$C$33)","v":""},"in",{"$f":"'Synthese Annuelle Monitoring'!$Q$37","v":0}]
[{"$f":"'0-INFOS GENERALES A REMPLIR'!$B$4","v":2021},{"$f":"'0-INFOS GENERALES A REMPLIR'!$B$6","v":0},{"$f":"'0-INFOS GENERALES A REMPLIR'!$E$12","v":""},null,null,null,null,null,{"$f":"IF(ISBLANK('4-PLANTES'!$E$6),\"\",'4-PLANTES'!$E$6)","v":0},{"$f":"IF(ISBLANK('4-PLANTES'!$E$8),\"\",'4-PLANTES'!$E$8)","v":0},null,{"$f":"IF(ISBLANK('4-PLANTES'!$E$12),\"\",'4-PLANTES'!$E$12)","v":""},null,null,{"$f":"IF(ISBLANK('4-PLANTES'!$E$10),\"\",'4-PLANTES'!$E$10)","v":""},null,{"$f":"VLOOKUP('compilation données pour export'!$R195,'listes valeurs'!$AB$2:$AE$3450,2,FALSE)","v":"Linaire bâtarde"},{"$f":"'4-PLANTES'!$C$17","v":"Kickxia"},{"$f":"VLOOKUP('compilation données pour export'!$R195,'listes valeurs'!$AB$2:$AE$3450,4,FALSE)","v":"Kickxia spuria"},{"$f":"VLOOKUP('compilation données pour export'!$R195,'listes valeurs'!$AB$2:$AE$3450,3,FALSE)","v":"Plantes"},"% présence dans SPB * ",{"$f":"IF('4-PLANTES'!$C$33=0,\"\",COUNTIF(V178:V192,1)/COUNTIF(V178:V192,\">-1\"))","v":""},"in",{"$f":"'Synthese Annuelle Monitoring'!$Q$37","v":0}]
[{"$f":"'0-INFOS GENERALES A REMPLIR'!$B$4","v":2021},{"$f":"'0-INFOS GENERALES A REMPLIR'!$B$6","v":0},{"$f":"'0-INFOS GENERALES A REMPLIR'!$E$12","v":""},null,null,null,{"$f":"IF(ISBLANK('4-PLANTES'!$A$18),\"\",'4-PLANTES'!$A$18)","v":""},{"$f":"IF(G196=\"\",\"\",CONCATENATE(C196,\"_\",G196))","v":""},{"$f":"IF(ISBLANK('4-PLANTES'!$E$6),\"\",'4-PLANTES'!$E$6)","v":0},{"$f":"IF(ISBLANK('4-PLANTES'!$E$8),\"\",'4-PLANTES'!$E$8)","v":0},null,{"$f":"IF(ISBLANK('4-PLANTES'!$E$12),\"\",'4-PLANTES'!$E$12)","v":""},null,null,{"$f":"IF(ISBLANK('4-PLANTES'!$E$10),\"\",'4-PLANTES'!$E$10)","v":""},null,{"$f":"VLOOKUP('compilation données pour export'!$R196,'listes valeurs'!$AB$2:$AE$3450,2,FALSE)","v":{"$error":"#N/A"}},{"$f":"'4-PLANTES'!$D$17","v":0},{"$f":"VLOOKUP('compilation données pour export'!$R196,'listes valeurs'!$AB$2:$AE$3450,4,FALSE)","v":{"$error":"#N/A"}},{"$f":"VLOOKUP('compilation données pour export'!$R196,'listes valeurs'!$AB$2:$AE$3450,3,FALSE)","v":{"$error":"#N/A"}},"Présence/absence",{"$f":"IF(ISBLANK('4-PLANTES'!$D$18),\"\",'4-PLANTES'!$D$18)","v":""},"in",{"$f":"'Synthese Annuelle Monitoring'!$Q$38","v":0}]
[{"$f":"'0-INFOS GENERALES A REMPLIR'!$B$4","v":2021},{"$f":"'0-INFOS GENERALES A REMPLIR'!$B$6","v":0},{"$f":"'0-INFOS GENERALES A REMPLIR'!$E$12","v":""},null,null,null,{"$f":"IF(ISBLANK('4-PLANTES'!$A$19),\"\",'4-PLANTES'!$A$19)","v":""},"",{"$f":"IF(ISBLANK('4-PLANTES'!$E$6),\"\",'4-PLANTES'!$E$6)","v":0},{"$f":"IF(ISBLANK('4-PLANTES'!$E$8),\"\",'4-PLANTES'!$E$8)","v":0},null,{"$f":"IF(ISBLANK('4-PLANTES'!$E$12),\"\",'4-PLANTES'!$E$12)","v":""},null,null,{"$f":"IF(ISBLANK('4-PLANTES'!$E$10),\"\",'4-PLANTES'!$E$10)","v":""},null,{"$f":"VLOOKUP('compilation données pour export'!$R197,'listes valeurs'!$AB$2:$AE$3450,2,FALSE)","v":{"$error":"#N/A"}},{"$f":"'4-PLANTES'!$D$17","v":0},{"$f":"VLOOKUP('compilation données pour export'!$R197,'listes valeurs'!$AB$2:$AE$3450,4,FALSE)","v":{"$error":"#N/A"}},{"$f":"VLOOKUP('compilation données pour export'!$R197,'listes valeurs'!$AB$2:$AE$3450,3,FALSE)","v":{"$error":"#N/A"}},"Présence/absence",{"$f":"IF(ISBLANK('4-PLANTES'!$D$19),\"\",'4-PLANTES'!$D$19)","v":""},"in",{"$f":"'Synthese Annuelle Monitoring'!$Q$38","v":0}]
[{"$f":"'0-INFOS GENERALES A REMPLIR'!$B$4","v":2021},{"$f":"'0-INFOS GENERALES A REMPLIR'!$B$6","v":0},{"$f":"'0-INFOS GENERALES A REMPLIR'!$E$12","v":""},null,null,null,{"$f":"IF(ISBLANK('4-PLANTES'!$A$20),\"\",'4-PLANTES'!$A$20)","v":""},"",{"$f":"IF(ISBLANK('4-PLANTES'!$E$6),\"\",'4-PLANTES'!$E$6)","v":0},{"$f":"IF(ISBLANK('4-PLANTES'!$E$8),\"\",'4-PLANTES'!$E$8)","v":0},null,{"$f":"IF(ISBLANK('4-PLANTES'!$E$12),\"\",'4-PLANTES'!$E$12)","v":""},null,null,{"$f":"IF(ISBLANK('4-PLANTES'!$E$10),\"\",'4-PLANTES'!$E$10)","v":""},null,{"$f":"VLOOKUP('compilation données pour export'!$R198,'listes valeurs'!$AB$2:$AE$3450,2,FALSE)","v":{"$error":"#N/A"}},{"$f":"'4-PLANTES'!$D$17","v":0},{"$f":"VLOOKUP('compilation données pour export'!$R198,'listes valeurs'!$AB$2:$AE$3450,4,FALSE)","v":{"$error":"#N/A"}},{"$f":"VLOOKUP('compilation données pour export'!$R198,'listes valeurs'!$AB$2:$AE$3450,3,FALSE)","v":{"$error":"#N/A"}},"Présence/absence",{"$f":"IF(ISBLANK('4-PLANTES'!$D$20),\"\",'4-PLANTES'!$D$20)","v":""},"in",{"$f":"'Synthese Annuelle Monitoring'!$Q$38","v":0}]
[{"$f":"'0-INFOS GENERALES A REMPLIR'!$B$4","v":2021},{"$f":"'0-INFOS GENERALES A REMPLIR'!$B$6","v":0},{"$f":"'0-INFOS GENERALES A REMPLIR'!$E$12","v":""},null,null,null,{"$f":"IF(ISBLANK('4-PLANTES'!$A$21),\"\",'4-PLANTES'!$A$21)","v":""},"",{"$f":"IF(ISBLANK('4-PLANTES'!$E$6),\"\",'4-PLANTES'!$E$6)","v":0},{"$f":"IF(ISBLANK('4-PLANTES'!$E$8),\"\",'4-PLANTES'!$E$8)","v":0},null,{"$f":"IF(ISBLANK('4-PLANTES'!$E$12),\"\",'4-PLANTES'!$E$12)","v":""},null,null,{"$f":"IF(ISBLANK('4-PLANTES'!$E$10),\"\",'4-PLANTES'!$E$10)","v":""},null,{"$f":"VLOOKUP('compilation données pour export'!$R199,'listes valeurs'!$AB$2:$AE$3450,2,FALSE)","v":{"$error":"#N/A"}},{"$f":"'4-PLANTES'!$D$17","v":0},{"$f":"VLOOKUP('compilation données pour export'!$R199,'listes valeurs'!$AB$2:$AE$3450,4,FALSE)","v":{"$error":"#N/A"}},{"$f":"VLOOKUP('compilation données pour export'!$R199,'listes valeurs'!$AB$2:$AE$3450,3,FALSE)","v":{"$error":"#N/A"}},"Présence/absence",{"$f":"IF(ISBLANK('4-PLANTES'!$D$21),\"\",'4-PLANTES'!$D$21)","v":""},"in",{"$f":"'Synthese Annuelle Monitoring'!$Q$38","v":0}]
[{"$f":"'0-INFOS GENERALES A REMPLIR'!$B$4","v":2021},{"$f":"'0-INFOS GENERALES A REMPLIR'!$B$6","v":0},{"$f":"'0-INFOS GENERALES A REMPLIR'!$E$12","v":""},null,null,null,{"$f":"IF(ISBLANK('4-PLANTES'!$A$22),\"\",'4-PLANTES'!$A$22)","v":""},"",{"$f":"IF(ISBLANK('4-PLANTES'!$E$6),\"\",'4-PLANTES'!$E$6)","v":0},{"$f":"IF(ISBLANK('4-PLANTES'!$E$8),\"\",'4-PLANTES'!$E$8)","v":0},null,{"$f":"IF(ISBLANK('4-PLANTES'!$E$12),\"\",'4-PLANTES'!$E$12)","v":""},null,null,{"$f":"IF(ISBLANK('4-PLANTES'!$E$10),\"\",'4-PLANTES'!$E$10)","v":""},null,{"$f":"VLOOKUP('compilation données pour export'!$R200,'listes valeurs'!$AB$2:$AE$3450,2,FALSE)","v":{"$error":"#N/A"}},{"$f":"'4-PLANTES'!$D$17","v":0},{"$f":"VLOOKUP('compilation données pour export'!$R200,'listes valeurs'!$AB$2:$AE$3450,4,FALSE)","v":{"$error":"#N/A"}},{"$f":"VLOOKUP('compilation données pour export'!$R200,'listes valeurs'!$AB$2:$AE$3450,3,FALSE)","v":{"$error":"#N/A"}},"Présence/absence",{"$f":"IF(ISBLANK('4-PLANTES'!$D$22),\"\",'4-PLANTES'!$D$22)","v":""},"in",{"$f":"'Synthese Annuelle Monitoring'!$Q$38","v":0}]
[{"$f":"'0-INFOS GENERALES A REMPLIR'!$B$4","v":2021},{"$f":"'0-INFOS GENERALES A REMPLIR'!$B$6","v":0},{"$f":"'0-INFOS GENERALES A REMPLIR'!$E$12","v":""},null,null,null,{"$f":"IF(ISBLANK('4-PLANTES'!$A$23),\"\",'4-PLANTES'!$A$23)","v":""},"",{"$f":"IF(ISBLANK('4-PLANTES'!$E$6),\"\",'4-PLANTES'!$E$6)","v":0},{"$f":"IF(ISBLANK('4-PLANTES'!$E$8),\"\",'4-PLANTES'!$E$8)","v":0},null,{"$f":"IF(ISBLANK('4-PLANTES'!$E$12),\"\",'4-PLANTES'!$E$12)","v":""},null,null,{"$f":"IF(ISBLANK('4-PLANTES'!$E$10),\"\",'4-PLANTES'!$E$10)","v":""},null,{"$f":"VLOOKUP('compilation données pour export'!$R201,'listes valeurs'!$AB$2:$AE$3450,2,FALSE)","v":{"$error":"#N/A"}},{"$f":"'4-PLANTES'!$D$17","v":0},{"$f":"VLOOKUP('compilation données pour export'!$R201,'listes valeurs'!$AB$2:$AE$3450,4,FALSE)","v":{"$error":"#N/A"}},{"$f":"VLOOKUP('compilation données pour export'!$R201,'listes valeurs'!$AB$2:$AE$3450,3,FALSE)","v":{"$error":"#N/A"}},"Présence/absence",{"$f":"IF(ISBLANK('4-PLANTES'!$D$23),\"\",'4-PLANTES'!$D$23)","v":""},"in",{"$f":"'Synthese Annuelle Monitoring'!$Q$38","v":0}]
[{"$f":"'0-INFOS GENERALES A REMPLIR'!$B$4","v":2021},{"$f":"'0-INFOS GENERALES A REMPLIR'!$B$6","v":0},{"$f":"'0-INFOS GENERALES A REMPLIR'!$E$12","v":""},null,null,null,{"$f":"IF(ISBLANK('4-PLANTES'!$A$24),\"\",'4-PLANTES'!$A$24)","v":""},"",{"$f":"IF(ISBLANK('4-PLANTES'!$E$6),\"\",'4-PLANTES'!$E$6)","v":0},{"$f":"IF(ISBLANK('4-PLANTES'!$E$8),\"\",'4-PLANTES'!$E$8)","v":0},null,{"$f":"IF(ISBLANK('4-PLANTES'!$E$12),\"\",'4-PLANTES'!$E$12)","v":""},null,null,{"$f":"IF(ISBLANK('4-PLANTES'!$E$10),\"\",'4-PLANTES'!$E$10)","v":""},null,{"$f":"VLOOKUP('compilation données pour export'!$R202,'listes valeurs'!$AB$2:$AE$3450,2,FALSE)","v":{"$error":"#N/A"}},{"$f":"'4-PLANTES'!$D$17","v":0},{"$f":"VLOOKUP('compilation données pour export'!$R202,'listes valeurs'!$AB$2:$AE$3450,4,FALSE)","v":{"$error":"#N/A"}},{"$f":"VLOOKUP('compilation données pour export'!$R202,'listes valeurs'!$AB$2:$AE$3450,3,FALSE)","v":{"$error":"#N/A"}},"Présence/absence",{"$f":"IF(ISBLANK('4-PLANTES'!$D$24),\"\",'4-PLANTES'!$D$24)","v":""},"in",{"$f":"'Synthese Annuelle Monitoring'!$Q$38","v":0}]
[{"$f":"'0-INFOS GENERALES A REMPLIR'!$B$4","v":2021},{"$f":"'0-INFOS GENERALES A REMPLIR'!$B$6","v":0},{"$f":"'0-INFOS GENERALES A REMPLIR'!$E$12","v":""},null,null,null,{"$f":"IF(ISBLANK('4-PLANTES'!$A$25),\"\",'4-PLANTES'!$A$25)","v":""},"",{"$f":"IF(ISBLANK('4-PLANTES'!$E$6),\"\",'4-PLANTES'!$E$6)","v":0},{"$f":"IF(ISBLANK('4-PLANTES'!$E$8),\"\",'4-PLANTES'!$E$8)","v":0},null,{"$f":"IF(ISBLANK('4-PLANTES'!$E$12),\"\",'4-PLANTES'!$E$12)","v":""},null,null,{"$f":"IF(ISBLANK('4-PLANTES'!$E$10),\"\",'4-PLANTES'!$E$10)","v":""},null,{"$f":"VLOOKUP('compilation données pour export'!$R203,'listes valeurs'!$AB$2:$AE$3450,2,FALSE)","v":{"$error":"#N/A"}},{"$f":"'4-PLANTES'!$D$17","v":0},{"$f":"VLOOKUP('compilation données pour export'!$R203,'listes valeurs'!$AB$2:$AE$3450,4,FALSE)","v":{"$error":"#N/A"}},{"$f":"VLOOKUP('compilation données pour export'!$R203,'listes valeurs'!$AB$2:$AE$3450,3,FALSE)","v":{"$error":"#N/A"}},"Présence/absence",{"$f":"IF(ISBLANK('4-PLANTES'!$D$25),\"\",'4-PLANTES'!$D$25)","v":""},"in",{"$f":"'Synthese Annuelle Monitoring'!$Q$38","v":0}]
[{"$f":"'0-INFOS GENERALES A REMPLIR'!$B$4","v":2021},{"$f":"'0-INFOS GENERALES A REMPLIR'!$B$6","v":0},{"$f":"'0-INFOS GENERALES A REMPLIR'!$E$12","v":""},null,null,null,{"$f":"IF(ISBLANK('4-PLANTES'!$A$26),\"\",'4-PLANTES'!$A$26)","v":""},"",{"$f":"IF(ISBLANK('4-PLANTES'!$E$6),\"\",'4-PLANTES'!$E$6)","v":0},{"$f":"IF(ISBLANK('4-PLANTES'!$E$8),\"\",'4-PLANTES'!$E$8)","v":0},null,{"$f":"IF(ISBLANK('4-PLANTES'!$E$12),\"\",'4-PLANTES'!$E$12)","v":""},null,null,{"$f":"IF(ISBLANK('4-PLANTES'!$E$10),\"\",'4-PLANTES'!$E$10)","v":""},null,{"$f":"VLOOKUP('compilation données pour export'!$R204,'listes valeurs'!$AB$2:$AE$3450,2,FALSE)","v":{"$error":"#N/A"}},{"$f":"'4-PLANTES'!$D$17","v":0},{"$f":"VLOOKUP('compilation données pour export'!$R204,'listes valeurs'!$AB$2:$AE$3450,4,FALSE)","v":{"$error":"#N/A"}},{"$f":"VLOOKUP('compilation données pour export'!$R204,'listes valeurs'!$AB$2:$AE$3450,3,FALSE)","v":{"$error":"#N/A"}},"Présence/absence",{"$f":"IF(ISBLANK('4-PLANTES'!$D$26),\"\",'4-PLANTES'!$D$26)","v":""},"in",{"$f":"'Synthese Annuelle Monitoring'!$Q$38","v":0}]
[{"$f":"'0-INFOS GENERALES A REMPLIR'!$B$4","v":2021},{"$f":"'0-INFOS GENERALES A REMPLIR'!$B$6","v":0},{"$f":"'0-INFOS GENERALES A REMPLIR'!$E$12","v":""},null,null,null,{"$f":"IF(ISBLANK('4-PLANTES'!$A$27),\"\",'4-PLANTES'!$A$27)","v":""},"",{"$f":"IF(ISBLANK('4-PLANTES'!$E$6),\"\",'4-PLANTES'!$E$6)","v":0},{"$f":"IF(ISBLANK('4-PLANTES'!$E$8),\"\",'4-PLANTES'!$E$8)","v":0},null,{"$f":"IF(ISBLANK('4-PLANTES'!$E$12),\"\",'4-PLANTES'!$E$12)","v":""},null,null,{"$f":"IF(ISBLANK('4-PLANTES'!$E$10),\"\",'4-PLANTES'!$E$10)","v":""},null,{"$f":"VLOOKUP('compilation données pour export'!$R205,'listes valeurs'!$AB$2:$AE$3450,2,FALSE)","v":{"$error":"#N/A"}},{"$f":"'4-PLANTES'!$D$17","v":0},{"$f":"VLOOKUP('compilation données pour export'!$R205,'listes valeurs'!$AB$2:$AE$3450,4,FALSE)","v":{"$error":"#N/A"}},{"$f":"VLOOKUP('compilation données pour export'!$R205,'listes valeurs'!$AB$2:$AE$3450,3,FALSE)","v":{"$error":"#N/A"}},"Présence/absence",{"$f":"IF(ISBLANK('4-PLANTES'!$D$27),\"\",'4-PLANTES'!$D$27)","v":""},"in",{"$f":"'Synthese Annuelle Monitoring'!$Q$38","v":0}]
[{"$f":"'0-INFOS GENERALES A REMPLIR'!$B$4","v":2021},{"$f":"'0-INFOS GENERALES A REMPLIR'!$B$6","v":0},{"$f":"'0-INFOS GENERALES A REMPLIR'!$E$12","v":""},null,null,null,{"$f":"IF(ISBLANK('4-PLANTES'!$A$28),\"\",'4-PLANTES'!$A$28)","v":""},"",{"$f":"IF(ISBLANK('4-PLANTES'!$E$6),\"\",'4-PLANTES'!$E$6)","v":0},{"$f":"IF(ISBLANK('4-PLANTES'!$E$8),\"\",'4-PLANTES'!$E$8)","v":0},null,{"$f":"IF(ISBLANK('4-PLANTES'!$E$12),\"\",'4-PLANTES'!$E$12)","v":""},null,null,{"$f":"IF(ISBLANK('4-PLANTES'!$E$10),\"\",'4-PLANTES'!$E$10)","v":""},null,{"$f":"VLOOKUP('compilation données pour export'!$R206,'listes valeurs'!$AB$2:$AE$3450,2,FALSE)","v":{"$error":"#N/A"}},{"$f":"'4-PLANTES'!$D$17","v":0},{"$f":"VLOOKUP('compilation données pour export'!$R206,'listes valeurs'!$AB$2:$AE$3450,4,FALSE)","v":{"$error":"#N/A"}},{"$f":"VLOOKUP('compilation données pour export'!$R206,'listes valeurs'!$AB$2:$AE$3450,3,FALSE)","v":{"$error":"#N/A"}},"Présence/absence",{"$f":"IF(ISBLANK('4-PLANTES'!$D$28),\"\",'4-PLANTES'!$D$28)","v":""},"in",{"$f":"'Synthese Annuelle Monitoring'!$Q$38","v":0}]
[{"$f":"'0-INFOS GENERALES A REMPLIR'!$B$4","v":2021},{"$f":"'0-INFOS GENERALES A REMPLIR'!$B$6","v":0},{"$f":"'0-INFOS GENERALES A REMPLIR'!$E$12","v":""},null,null,null,{"$f":"IF(ISBLANK('4-PLANTES'!$A$29),\"\",'4-PLANTES'!$A$29)","v":""},"",{"$f":"IF(ISBLANK('4-PLANTES'!$E$6),\"\",'4-PLANTES'!$E$6)","v":0},{"$f":"IF(ISBLANK('4-PLANTES'!$E$8),\"\",'4-PLANTES'!$E$8)","v":0},null,{"$f":"IF(ISBLANK('4-PLANTES'!$E$12),\"\",'4-PLANTES'!$E$12)","v":""},null,null,{"$f":"IF(ISBLANK('4-PLANTES'!$E$10),\"\",'4-PLANTES'!$E$10)","v":""},null,{"$f":"VLOOKUP('compilation données pour export'!$R207,'listes valeurs'!$AB$2:$AE$3450,2,FALSE)","v":{"$error":"#N/A"}},{"$f":"'4-PLANTES'!$D$17","v":0},{"$f":"VLOOKUP('compilation données pour export'!$R207,'listes valeurs'!$AB$2:$AE$3450,4,FALSE)","v":{"$error":"#N/A"}},{"$f":"VLOOKUP('compilation données pour export'!$R207,'listes valeurs'!$AB$2:$AE$3450,3,FALSE)","v":{"$error":"#N/A"}},"Présence/absence",{"$f":"IF(ISBLANK('4-PLANTES'!$D$29),\"\",'4-PLANTES'!$D$29)","v":""},"in",{"$f":"'Synthese Annuelle Monitoring'!$Q$38","v":0}]
[{"$f":"'0-INFOS GENERALES A REMPLIR'!$B$4","v":2021},{"$f":"'0-INFOS GENERALES A REMPLIR'!$B$6","v":0},{"$f":"'0-INFOS GENERALES A REMPLIR'!$E$12","v":""},null,null,null,{"$f":"IF(ISBLANK('4-PLANTES'!$A$30),\"\",'4-PLANTES'!$A$30)","v":""},"",{"$f":"IF(ISBLANK('4-PLANTES'!$E$6),\"\",'4-PLANTES'!$E$6)","v":0},{"$f":"IF(ISBLANK('4-PLANTES'!$E$8),\"\",'4-PLANTES'!$E$8)","v":0},null,{"$f":"IF(ISBLANK('4-PLANTES'!$E$12),\"\",'4-PLANTES'!$E$12)","v":""},null,null,{"$f":"IF(ISBLANK('4-PLANTES'!$E$10),\"\",'4-PLANTES'!$E$10)","v":""},null,{"$f":"VLOOKUP('compilation données pour export'!$R208,'listes valeurs'!$AB$2:$AE$3450,2,FALSE)","v":{"$error":"#N/A"}},{"$f":"'4-PLANTES'!$D$17","v":0},{"$f":"VLOOKUP('compilation données pour export'!$R208,'listes valeurs'!$AB$2:$AE$3450,4,FALSE)","v":{"$error":"#N/A"}},{"$f":"VLOOKUP('compilation données pour export'!$R208,'listes valeurs'!$AB$2:$AE$3450,3,FALSE)","v":{"$error":"#N/A"}},"Présence/absence",{"$f":"IF(ISBLANK('4-PLANTES'!$D$30),\"\",'4-PLANTES'!$D$30)","v":""},"in",{"$f":"'Synthese Annuelle Monitoring'!$Q$38","v":0}]
[{"$f":"'0-INFOS GENERALES A REMPLIR'!$B$4","v":2021},{"$f":"'0-INFOS GENERALES A REMPLIR'!$B$6","v":0},{"$f":"'0-INFOS GENERALES A REMPLIR'!$E$12","v":""},null,null,null,{"$f":"IF(ISBLANK('4-PLANTES'!$A$31),\"\",'4-PLANTES'!$A$31)","v":""},"",{"$f":"IF(ISBLANK('4-PLANTES'!$E$6),\"\",'4-PLANTES'!$E$6)","v":0},{"$f":"IF(ISBLANK('4-PLANTES'!$E$8),\"\",'4-PLANTES'!$E$8)","v":0},null,{"$f":"IF(ISBLANK('4-PLANTES'!$E$12),\"\",'4-PLANTES'!$E$12)","v":""},null,null,{"$f":"IF(ISBLANK('4-PLANTES'!$E$10),\"\",'4-PLANTES'!$E$10)","v":""},null,{"$f":"VLOOKUP('compilation données pour export'!$R209,'listes valeurs'!$AB$2:$AE$3450,2,FALSE)","v":{"$error":"#N/A"}},{"$f":"'4-PLANTES'!$D$17","v":0},{"$f":"VLOOKUP('compilation données pour export'!$R209,'listes valeurs'!$AB$2:$AE$3450,4,FALSE)","v":{"$error":"#N/A"}},{"$f":"VLOOKUP('compilation données pour export'!$R209,'listes valeurs'!$AB$2:$AE$3450,3,FALSE)","v":{"$error":"#N/A"}},"Présence/absence",{"$f":"IF(ISBLANK('4-PLANTES'!$D$31),\"\",'4-PLANTES'!$D$31)","v":""},"in",{"$f":"'Synthese Annuelle Monitoring'!$Q$38","v":0}]
[{"$f":"'0-INFOS GENERALES A REMPLIR'!$B$4","v":2021},{"$f":"'0-INFOS GENERALES A REMPLIR'!$B$6","v":0},{"$f":"'0-INFOS GENERALES A REMPLIR'!$E$12","v":""},null,null,null,{"$f":"IF(ISBLANK('4-PLANTES'!$A$32),\"\",'4-PLANTES'!$A$32)","v":""},"",{"$f":"IF(ISBLANK('4-PLANTES'!$E$6),\"\",'4-PLANTES'!$E$6)","v":0},{"$f":"IF(ISBLANK('4-PLANTES'!$E$8),\"\",'4-PLANTES'!$E$8)","v":0},null,{"$f":"IF(ISBLANK('4-PLANTES'!$E$12),\"\",'4-PLANTES'!$E$12)","v":""},null,null,{"$f":"IF(ISBLANK('4-PLANTES'!$E$10),\"\",'4-PLANTES'!$E$10)","v":""},null,{"$f":"VLOOKUP('compilation données pour export'!$R210,'listes valeurs'!$AB$2:$AE$3450,2,FALSE)","v":{"$error":"#N/A"}},{"$f":"'4-PLANTES'!$D$17","v":0},{"$f":"VLOOKUP('compilation données pour export'!$R210,'listes valeurs'!$AB$2:$AE$3450,4,FALSE)","v":{"$error":"#N/A"}},{"$f":"VLOOKUP('compilation données pour export'!$R210,'listes valeurs'!$AB$2:$AE$3450,3,FALSE)","v":{"$error":"#N/A"}},"Présence/absence",{"$f":"IF(ISBLANK('4-PLANTES'!$D$32),\"\",'4-PLANTES'!$D$32)","v":""},"in",{"$f":"'Synthese Annuelle Monitoring'!$Q$38","v":0}]
[{"$f":"'0-INFOS GENERALES A REMPLIR'!$B$4","v":2021},{"$f":"'0-INFOS GENERALES A REMPLIR'!$B$6","v":0},{"$f":"'0-INFOS GENERALES A REMPLIR'!$E$12","v":""},null,null,null,null,null,{"$f":"IF(ISBLANK('4-PLANTES'!$E$6),\"\",'4-PLANTES'!$E$6)","v":0},{"$f":"IF(ISBLANK('4-PLANTES'!$E$8),\"\",'4-PLANTES'!$E$8)","v":0},null,{"$f":"IF(ISBLANK('4-PLANTES'!$E$12),\"\",'4-PLANTES'!$E$12)","v":""},null,null,{"$f":"IF(ISBLANK('4-PLANTES'!$E$10),\"\",'4-PLANTES'!$E$10)","v":""},null,{"$f":"VLOOKUP('compilation données pour export'!$R211,'listes valeurs'!$AB$2:$AE$3450,2,FALSE)","v":{"$error":"#N/A"}},{"$f":"'4-PLANTES'!$D$17","v":0},{"$f":"VLOOKUP('compilation données pour export'!$R211,'listes valeurs'!$AB$2:$AE$3450,4,FALSE)","v":{"$error":"#N/A"}},{"$f":"VLOOKUP('compilation données pour export'!$R211,'listes valeurs'!$AB$2:$AE$3450,3,FALSE)","v":{"$error":"#N/A"}},"Présence/absence",{"$f":"IF(ISBLANK('4-PLANTES'!$D$35),\"\",IF('4-PLANTES'!$D$35=\"non\",0,IF('4-PLANTES'!$D$35=\"oui\",1,\"erreur de saisie\")))","v":""},"out",{"$f":"'Synthese Annuelle Monitoring'!$Q$38","v":0}]
[{"$f":"'0-INFOS GENERALES A REMPLIR'!$B$4","v":2021},{"$f":"'0-INFOS GENERALES A REMPLIR'!$B$6","v":0},{"$f":"'0-INFOS GENERALES A REMPLIR'!$E$12","v":""},null,null,null,null,null,{"$f":"IF(ISBLANK('4-PLANTES'!$E$6),\"\",'4-PLANTES'!$E$6)","v":0},{"$f":"IF(ISBLANK('4-PLANTES'!$E$8),\"\",'4-PLANTES'!$E$8)","v":0},null,{"$f":"IF(ISBLANK('4-PLANTES'!$E$12),\"\",'4-PLANTES'!$E$12)","v":""},null,null,{"$f":"IF(ISBLANK('4-PLANTES'!$E$10),\"\",'4-PLANTES'!$E$10)","v":""},null,{"$f":"VLOOKUP('compilation données pour export'!$R212,'listes valeurs'!$AB$2:$AE$3450,2,FALSE)","v":{"$error":"#N/A"}},{"$f":"'4-PLANTES'!$D$17","v":0},{"$f":"VLOOKUP('compilation données pour export'!$R212,'listes valeurs'!$AB$2:$AE$3450,4,FALSE)","v":{"$error":"#N/A"}},{"$f":"VLOOKUP('compilation données pour export'!$R212,'listes valeurs'!$AB$2:$AE$3450,3,FALSE)","v":{"$error":"#N/A"}},"Nb parcelles SPB positives",{"$f":"IF('4-PLANTES'!$D$33=0,\"\",'4-PLANTES'!$D$33)","v":""},"in",{"$f":"'Synthese Annuelle Monitoring'!$Q$38","v":0}]
[{"$f":"'0-INFOS GENERALES A REMPLIR'!$B$4","v":2021},{"$f":"'0-INFOS GENERALES A REMPLIR'!$B$6","v":0},{"$f":"'0-INFOS GENERALES A REMPLIR'!$E$12","v":""},null,null,null,null,null,{"$f":"IF(ISBLANK('4-PLANTES'!$E$6),\"\",'4-PLANTES'!$E$6)","v":0},{"$f":"IF(ISBLANK('4-PLANTES'!$E$8),\"\",'4-PLANTES'!$E$8)","v":0},null,{"$f":"IF(ISBLANK('4-PLANTES'!$E$12),\"\",'4-PLANTES'!$E$12)","v":""},null,null,{"$f":"IF(ISBLANK('4-PLANTES'!$E$10),\"\",'4-PLANTES'!$E$10)","v":""},null,{"$f":"VLOOKUP('compilation données pour export'!$R213,'listes valeurs'!$AB$2:$AE$3450,2,FALSE)","v":{"$error":"#N/A"}},{"$f":"'4-PLANTES'!$D$17","v":0},{"$f":"VLOOKUP('compilation données pour export'!$R213,'listes valeurs'!$AB$2:$AE$3450,4,FALSE)","v":{"$error":"#N/A"}},{"$f":"VLOOKUP('compilation données pour export'!$R213,'listes valeurs'!$AB$2:$AE$3450,3,FALSE)","v":{"$error":"#N/A"}},"% présence dans SPB * ",{"$f":"IF('4-PLANTES'!$B$33=0,\"\",COUNTIF(V196:V210,1)/COUNTIF(V196:V210,\">-1\"))","v":""},"in",{"$f":"'Synthese Annuelle Monitoring'!$Q$38","v":0}]
[{"$f":"'0-INFOS GENERALES A REMPLIR'!$B$4","v":2021},{"$f":"'0-INFOS GENERALES A REMPLIR'!$B$6","v":0},{"$f":"'0-INFOS GENERALES A REMPLIR'!$E$12","v":""},null,null,null,{"$f":"IF(ISBLANK('4-PLANTES'!$A$18),\"\",'4-PLANTES'!$A$18)","v":""},{"$f":"IF(G214=\"\",\"\",CONCATENATE(C214,\"_\",G214))","v":""},{"$f":"IF(ISBLANK('4-PLANTES'!$E$6),\"\",'4-PLANTES'!$E$6)","v":0},{"$f":"IF(ISBLANK('4-PLANTES'!$E$8),\"\",'4-PLANTES'!$E$8)","v":0},null,{"$f":"IF(ISBLANK('4-PLANTES'!$E$12),\"\",'4-PLANTES'!$E$12)","v":""},null,null,{"$f":"IF(ISBLANK('4-PLANTES'!$E$10),\"\",'4-PLANTES'!$E$10)","v":""},null,{"$f":"VLOOKUP('compilation données pour export'!$R214,'listes valeurs'!$AB$2:$AE$3450,2,FALSE)","v":{"$error":"#N/A"}},{"$f":"'4-PLANTES'!$E$17","v":0},{"$f":"VLOOKUP('compilation données pour export'!$R214,'listes valeurs'!$AB$2:$AE$3450,4,FALSE)","v":{"$error":"#N/A"}},{"$f":"VLOOKUP('compilation données pour export'!$R214,'listes valeurs'!$AB$2:$AE$3450,3,FALSE)","v":{"$error":"#N/A"}},"Présence/absence",{"$f":"IF(ISBLANK('4-PLANTES'!$E$18),\"\",'4-PLANTES'!$E$18)","v":""},"in",{"$f":"'Synthese Annuelle Monitoring'!$Q$39","v":0}]
[{"$f":"'0-INFOS GENERALES A REMPLIR'!$B$4","v":2021},{"$f":"'0-INFOS GENERALES A REMPLIR'!$B$6","v":0},{"$f":"'0-INFOS GENERALES A REMPLIR'!$E$12","v":""},null,null,null,{"$f":"IF(ISBLANK('4-PLANTES'!$A$19),\"\",'4-PLANTES'!$A$19)","v":""},"",{"$f":"IF(ISBLANK('4-PLANTES'!$E$6),\"\",'4-PLANTES'!$E$6)","v":0},{"$f":"IF(ISBLANK('4-PLANTES'!$E$8),\"\",'4-PLANTES'!$E$8)","v":0},null,{"$f":"IF(ISBLANK('4-PLANTES'!$E$12),\"\",'4-PLANTES'!$E$12)","v":""},null,null,{"$f":"IF(ISBLANK('4-PLANTES'!$E$10),\"\",'4-PLANTES'!$E$10)","v":""},null,{"$f":"VLOOKUP('compilation données pour export'!$R215,'listes valeurs'!$AB$2:$AE$3450,2,FALSE)","v":{"$error":"#N/A"}},{"$f":"'4-PLANTES'!$E$17","v":0},{"$f":"VLOOKUP('compilation données pour export'!$R215,'listes valeurs'!$AB$2:$AE$3450,4,FALSE)","v":{"$error":"#N/A"}},{"$f":"VLOOKUP('compilation données pour export'!$R215,'listes valeurs'!$AB$2:$AE$3450,3,FALSE)","v":{"$error":"#N/A"}},"Présence/absence",{"$f":"IF(ISBLANK('4-PLANTES'!$E$19),\"\",'4-PLANTES'!$E$19)","v":""},"in",{"$f":"'Synthese Annuelle Monitoring'!$Q$39","v":0}]
[{"$f":"'0-INFOS GENERALES A REMPLIR'!$B$4","v":2021},{"$f":"'0-INFOS GENERALES A REMPLIR'!$B$6","v":0},{"$f":"'0-INFOS GENERALES A REMPLIR'!$E$12","v":""},null,null,null,{"$f":"IF(ISBLANK('4-PLANTES'!$A$20),\"\",'4-PLANTES'!$A$20)","v":""},"",{"$f":"IF(ISBLANK('4-PLANTES'!$E$6),\"\",'4-PLANTES'!$E$6)","v":0},{"$f":"IF(ISBLANK('4-PLANTES'!$E$8),\"\",'4-PLANTES'!$E$8)","v":0},null,{"$f":"IF(ISBLANK('4-PLANTES'!$E$12),\"\",'4-PLANTES'!$E$12)","v":""},null,null,{"$f":"IF(ISBLANK('4-PLANTES'!$E$10),\"\",'4-PLANTES'!$E$10)","v":""},null,{"$f":"VLOOKUP('compilation données pour export'!$R216,'listes valeurs'!$AB$2:$AE$3450,2,FALSE)","v":{"$error":"#N/A"}},{"$f":"'4-PLANTES'!$E$17","v":0},{"$f":"VLOOKUP('compilation données pour export'!$R216,'listes valeurs'!$AB$2:$AE$3450,4,FALSE)","v":{"$error":"#N/A"}},{"$f":"VLOOKUP('compilation données pour export'!$R216,'listes valeurs'!$AB$2:$AE$3450,3,FALSE)","v":{"$error":"#N/A"}},"Présence/absence",{"$f":"IF(ISBLANK('4-PLANTES'!$E$20),\"\",'4-PLANTES'!$E$20)","v":""},"in",{"$f":"'Synthese Annuelle Monitoring'!$Q$39","v":0}]
[{"$f":"'0-INFOS GENERALES A REMPLIR'!$B$4","v":2021},{"$f":"'0-INFOS GENERALES A REMPLIR'!$B$6","v":0},{"$f":"'0-INFOS GENERALES A REMPLIR'!$E$12","v":""},null,null,null,{"$f":"IF(ISBLANK('4-PLANTES'!$A$21),\"\",'4-PLANTES'!$A$21)","v":""},"",{"$f":"IF(ISBLANK('4-PLANTES'!$E$6),\"\",'4-PLANTES'!$E$6)","v":0},{"$f":"IF(ISBLANK('4-PLANTES'!$E$8),\"\",'4-PLANTES'!$E$8)","v":0},null,{"$f":"IF(ISBLANK('4-PLANTES'!$E$12),\"\",'4-PLANTES'!$E$12)","v":""},null,null,{"$f":"IF(ISBLANK('4-PLANTES'!$E$10),\"\",'4-PLANTES'!$E$10)","v":""},null,{"$f":"VLOOKUP('compilation données pour export'!$R217,'listes valeurs'!$AB$2:$AE$3450,2,FALSE)","v":{"$error":"#N/A"}},{"$f":"'4-PLANTES'!$E$17","v":0},{"$f":"VLOOKUP('compilation données pour export'!$R217,'listes valeurs'!$AB$2:$AE$3450,4,FALSE)","v":{"$error":"#N/A"}},{"$f":"VLOOKUP('compilation données pour export'!$R217,'listes valeurs'!$AB$2:$AE$3450,3,FALSE)","v":{"$error":"#N/A"}},"Présence/absence",{"$f":"IF(ISBLANK('4-PLANTES'!$E$21),\"\",'4-PLANTES'!$E$21)","v":""},"in",{"$f":"'Synthese Annuelle Monitoring'!$Q$39","v":0}]
[{"$f":"'0-INFOS GENERALES A REMPLIR'!$B$4","v":2021},{"$f":"'0-INFOS GENERALES A REMPLIR'!$B$6","v":0},{"$f":"'0-INFOS GENERALES A REMPLIR'!$E$12","v":""},null,null,null,{"$f":"IF(ISBLANK('4-PLANTES'!$A$22),\"\",'4-PLANTES'!$A$22)","v":""},"",{"$f":"IF(ISBLANK('4-PLANTES'!$E$6),\"\",'4-PLANTES'!$E$6)","v":0},{"$f":"IF(ISBLANK('4-PLANTES'!$E$8),\"\",'4-PLANTES'!$E$8)","v":0},null,{"$f":"IF(ISBLANK('4-PLANTES'!$E$12),\"\",'4-PLANTES'!$E$12)","v":""},null,null,{"$f":"IF(ISBLANK('4-PLANTES'!$E$10),\"\",'4-PLANTES'!$E$10)","v":""},null,{"$f":"VLOOKUP('compilation données pour export'!$R218,'listes valeurs'!$AB$2:$AE$3450,2,FALSE)","v":{"$error":"#N/A"}},{"$f":"'4-PLANTES'!$E$17","v":0},{"$f":"VLOOKUP('compilation données pour export'!$R218,'listes valeurs'!$AB$2:$AE$3450,4,FALSE)","v":{"$error":"#N/A"}},{"$f":"VLOOKUP('compilation données pour export'!$R218,'listes valeurs'!$AB$2:$AE$3450,3,FALSE)","v":{"$error":"#N/A"}},"Présence/absence",{"$f":"IF(ISBLANK('4-PLANTES'!$E$22),\"\",'4-PLANTES'!$E$22)","v":""},"in",{"$f":"'Synthese Annuelle Monitoring'!$Q$39","v":0}]
[{"$f":"'0-INFOS GENERALES A REMPLIR'!$B$4","v":2021},{"$f":"'0-INFOS GENERALES A REMPLIR'!$B$6","v":0},{"$f":"'0-INFOS GENERALES A REMPLIR'!$E$12","v":""},null,null,null,{"$f":"IF(ISBLANK('4-PLANTES'!$A$23),\"\",'4-PLANTES'!$A$23)","v":""},"",{"$f":"IF(ISBLANK('4-PLANTES'!$E$6),\"\",'4-PLANTES'!$E$6)","v":0},{"$f":"IF(ISBLANK('4-PLANTES'!$E$8),\"\",'4-PLANTES'!$E$8)","v":0},null,{"$f":"IF(ISBLANK('4-PLANTES'!$E$12),\"\",'4-PLANTES'!$E$12)","v":""},null,null,{"$f":"IF(ISBLANK('4-PLANTES'!$E$10),\"\",'4-PLANTES'!$E$10)","v":""},null,{"$f":"VLOOKUP('compilation données pour export'!$R219,'listes valeurs'!$AB$2:$AE$3450,2,FALSE)","v":{"$error":"#N/A"}},{"$f":"'4-PLANTES'!$E$17","v":0},{"$f":"VLOOKUP('compilation données pour export'!$R219,'listes valeurs'!$AB$2:$AE$3450,4,FALSE)","v":{"$error":"#N/A"}},{"$f":"VLOOKUP('compilation données pour export'!$R219,'listes valeurs'!$AB$2:$AE$3450,3,FALSE)","v":{"$error":"#N/A"}},"Présence/absence",{"$f":"IF(ISBLANK('4-PLANTES'!$E$23),\"\",'4-PLANTES'!$E$23)","v":""},"in",{"$f":"'Synthese Annuelle Monitoring'!$Q$39","v":0}]
[{"$f":"'0-INFOS GENERALES A REMPLIR'!$B$4","v":2021},{"$f":"'0-INFOS GENERALES A REMPLIR'!$B$6","v":0},{"$f":"'0-INFOS GENERALES A REMPLIR'!$E$12","v":""},null,null,null,{"$f":"IF(ISBLANK('4-PLANTES'!$A$24),\"\",'4-PLANTES'!$A$24)","v":""},"",{"$f":"IF(ISBLANK('4-PLANTES'!$E$6),\"\",'4-PLANTES'!$E$6)","v":0},{"$f":"IF(ISBLANK('4-PLANTES'!$E$8),\"\",'4-PLANTES'!$E$8)","v":0},null,{"$f":"IF(ISBLANK('4-PLANTES'!$E$12),\"\",'4-PLANTES'!$E$12)","v":""},null,null,{"$f":"IF(ISBLANK('4-PLANTES'!$E$10),\"\",'4-PLANTES'!$E$10)","v":""},null,{"$f":"VLOOKUP('compilation données pour export'!$R220,'listes valeurs'!$AB$2:$AE$3450,2,FALSE)","v":{"$error":"#N/A"}},{"$f":"'4-PLANTES'!$E$17","v":0},{"$f":"VLOOKUP('compilation données pour export'!$R220,'listes valeurs'!$AB$2:$AE$3450,4,FALSE)","v":{"$error":"#N/A"}},{"$f":"VLOOKUP('compilation données pour export'!$R220,'listes valeurs'!$AB$2:$AE$3450,3,FALSE)","v":{"$error":"#N/A"}},"Présence/absence",{"$f":"IF(ISBLANK('4-PLANTES'!$E$24),\"\",'4-PLANTES'!$E$24)","v":""},"in",{"$f":"'Synthese Annuelle Monitoring'!$Q$39","v":0}]
[{"$f":"'0-INFOS GENERALES A REMPLIR'!$B$4","v":2021},{"$f":"'0-INFOS GENERALES A REMPLIR'!$B$6","v":0},{"$f":"'0-INFOS GENERALES A REMPLIR'!$E$12","v":""},null,null,null,{"$f":"IF(ISBLANK('4-PLANTES'!$A$25),\"\",'4-PLANTES'!$A$25)","v":""},"",{"$f":"IF(ISBLANK('4-PLANTES'!$E$6),\"\",'4-PLANTES'!$E$6)","v":0},{"$f":"IF(ISBLANK('4-PLANTES'!$E$8),\"\",'4-PLANTES'!$E$8)","v":0},null,{"$f":"IF(ISBLANK('4-PLANTES'!$E$12),\"\",'4-PLANTES'!$E$12)","v":""},null,null,{"$f":"IF(ISBLANK('4-PLANTES'!$E$10),\"\",'4-PLANTES'!$E$10)","v":""},null,{"$f":"VLOOKUP('compilation données pour export'!$R221,'listes valeurs'!$AB$2:$AE$3450,2,FALSE)","v":{"$error":"#N/A"}},{"$f":"'4-PLANTES'!$E$17","v":0},{"$f":"VLOOKUP('compilation données pour export'!$R221,'listes valeurs'!$AB$2:$AE$3450,4,FALSE)","v":{"$error":"#N/A"}},{"$f":"VLOOKUP('compilation données pour export'!$R221,'listes valeurs'!$AB$2:$AE$3450,3,FALSE)","v":{"$error":"#N/A"}},"Présence/absence",{"$f":"IF(ISBLANK('4-PLANTES'!$E$25),\"\",'4-PLANTES'!$E$25)","v":""},"in",{"$f":"'Synthese Annuelle Monitoring'!$Q$39","v":0}]
[{"$f":"'0-INFOS GENERALES A REMPLIR'!$B$4","v":2021},{"$f":"'0-INFOS GENERALES A REMPLIR'!$B$6","v":0},{"$f":"'0-INFOS GENERALES A REMPLIR'!$E$12","v":""},null,null,null,{"$f":"IF(ISBLANK('4-PLANTES'!$A$26),\"\",'4-PLANTES'!$A$26)","v":""},"",{"$f":"IF(ISBLANK('4-PLANTES'!$E$6),\"\",'4-PLANTES'!$E$6)","v":0},{"$f":"IF(ISBLANK('4-PLANTES'!$E$8),\"\",'4-PLANTES'!$E$8)","v":0},null,{"$f":"IF(ISBLANK('4-PLANTES'!$E$12),\"\",'4-PLANTES'!$E$12)","v":""},null,null,{"$f":"IF(ISBLANK('4-PLANTES'!$E$10),\"\",'4-PLANTES'!$E$10)","v":""},null,{"$f":"VLOOKUP('compilation données pour export'!$R222,'listes valeurs'!$AB$2:$AE$3450,2,FALSE)","v":{"$error":"#N/A"}},{"$f":"'4-PLANTES'!$E$17","v":0},{"$f":"VLOOKUP('compilation données pour export'!$R222,'listes valeurs'!$AB$2:$AE$3450,4,FALSE)","v":{"$error":"#N/A"}},{"$f":"VLOOKUP('compilation données pour export'!$R222,'listes valeurs'!$AB$2:$AE$3450,3,FALSE)","v":{"$error":"#N/A"}},"Présence/absence",{"$f":"IF(ISBLANK('4-PLANTES'!$E$26),\"\",'4-PLANTES'!$E$26)","v":""},"in",{"$f":"'Synthese Annuelle Monitoring'!$Q$39","v":0}]
[{"$f":"'0-INFOS GENERALES A REMPLIR'!$B$4","v":2021},{"$f":"'0-INFOS GENERALES A REMPLIR'!$B$6","v":0},{"$f":"'0-INFOS GENERALES A REMPLIR'!$E$12","v":""},null,null,null,{"$f":"IF(ISBLANK('4-PLANTES'!$A$27),\"\",'4-PLANTES'!$A$27)","v":""},"",{"$f":"IF(ISBLANK('4-PLANTES'!$E$6),\"\",'4-PLANTES'!$E$6)","v":0},{"$f":"IF(ISBLANK('4-PLANTES'!$E$8),\"\",'4-PLANTES'!$E$8)","v":0},null,{"$f":"IF(ISBLANK('4-PLANTES'!$E$12),\"\",'4-PLANTES'!$E$12)","v":""},null,null,{"$f":"IF(ISBLANK('4-PLANTES'!$E$10),\"\",'4-PLANTES'!$E$10)","v":""},null,{"$f":"VLOOKUP('compilation données pour export'!$R223,'listes valeurs'!$AB$2:$AE$3450,2,FALSE)","v":{"$error":"#N/A"}},{"$f":"'4-PLANTES'!$E$17","v":0},{"$f":"VLOOKUP('compilation données pour export'!$R223,'listes valeurs'!$AB$2:$AE$3450,4,FALSE)","v":{"$error":"#N/A"}},{"$f":"VLOOKUP('compilation données pour export'!$R223,'listes valeurs'!$AB$2:$AE$3450,3,FALSE)","v":{"$error":"#N/A"}},"Présence/absence",{"$f":"IF(ISBLANK('4-PLANTES'!$E$27),\"\",'4-PLANTES'!$E$27)","v":""},"in",{"$f":"'Synthese Annuelle Monitoring'!$Q$39","v":0}]
[{"$f":"'0-INFOS GENERALES A REMPLIR'!$B$4","v":2021},{"$f":"'0-INFOS GENERALES A REMPLIR'!$B$6","v":0},{"$f":"'0-INFOS GENERALES A REMPLIR'!$E$12","v":""},null,null,null,{"$f":"IF(ISBLANK('4-PLANTES'!$A$28),\"\",'4-PLANTES'!$A$28)","v":""},"",{"$f":"IF(ISBLANK('4-PLANTES'!$E$6),\"\",'4-PLANTES'!$E$6)","v":0},{"$f":"IF(ISBLANK('4-PLANTES'!$E$8),\"\",'4-PLANTES'!$E$8)","v":0},null,{"$f":"IF(ISBLANK('4-PLANTES'!$E$12),\"\",'4-PLANTES'!$E$12)","v":""},null,null,{"$f":"IF(ISBLANK('4-PLANTES'!$E$10),\"\",'4-PLANTES'!$E$10)","v":""},null,{"$f":"VLOOKUP('compilation données pour export'!$R224,'listes valeurs'!$AB$2:$AE$3450,2,FALSE)","v":{"$error":"#N/A"}},{"$f":"'4-PLANTES'!$E$17","v":0},{"$f":"VLOOKUP('compilation données pour export'!$R224,'listes valeurs'!$AB$2:$AE$3450,4,FALSE)","v":{"$error":"#N/A"}},{"$f":"VLOOKUP('compilation données pour export'!$R224,'listes valeurs'!$AB$2:$AE$3450,3,FALSE)","v":{"$error":"#N/A"}},"Présence/absence",{"$f":"IF(ISBLANK('4-PLANTES'!$E$28),\"\",'4-PLANTES'!$E$28)","v":""},"in",{"$f":"'Synthese Annuelle Monitoring'!$Q$39","v":0}]
[{"$f":"'0-INFOS GENERALES A REMPLIR'!$B$4","v":2021},{"$f":"'0-INFOS GENERALES A REMPLIR'!$B$6","v":0},{"$f":"'0-INFOS GENERALES A REMPLIR'!$E$12","v":""},null,null,null,{"$f":"IF(ISBLANK('4-PLANTES'!$A$29),\"\",'4-PLANTES'!$A$29)","v":""},"",{"$f":"IF(ISBLANK('4-PLANTES'!$E$6),\"\",'4-PLANTES'!$E$6)","v":0},{"$f":"IF(ISBLANK('4-PLANTES'!$E$8),\"\",'4-PLANTES'!$E$8)","v":0},null,{"$f":"IF(ISBLANK('4-PLANTES'!$E$12),\"\",'4-PLANTES'!$E$12)","v":""},null,null,{"$f":"IF(ISBLANK('4-PLANTES'!$E$10),\"\",'4-PLANTES'!$E$10)","v":""},null,{"$f":"VLOOKUP('compilation données pour export'!$R225,'listes valeurs'!$AB$2:$AE$3450,2,FALSE)","v":{"$error":"#N/A"}},{"$f":"'4-PLANTES'!$E$17","v":0},{"$f":"VLOOKUP('compilation données pour export'!$R225,'listes valeurs'!$AB$2:$AE$3450,4,FALSE)","v":{"$error":"#N/A"}},{"$f":"VLOOKUP('compilation données pour export'!$R225,'listes valeurs'!$AB$2:$AE$3450,3,FALSE)","v":{"$error":"#N/A"}},"Présence/absence",{"$f":"IF(ISBLANK('4-PLANTES'!$E$29),\"\",'4-PLANTES'!$E$29)","v":""},"in",{"$f":"'Synthese Annuelle Monitoring'!$Q$39","v":0}]
[{"$f":"'0-INFOS GENERALES A REMPLIR'!$B$4","v":2021},{"$f":"'0-INFOS GENERALES A REMPLIR'!$B$6","v":0},{"$f":"'0-INFOS GENERALES A REMPLIR'!$E$12","v":""},null,null,null,{"$f":"IF(ISBLANK('4-PLANTES'!$A$30),\"\",'4-PLANTES'!$A$30)","v":""},"",{"$f":"IF(ISBLANK('4-PLANTES'!$E$6),\"\",'4-PLANTES'!$E$6)","v":0},{"$f":"IF(ISBLANK('4-PLANTES'!$E$8),\"\",'4-PLANTES'!$E$8)","v":0},null,{"$f":"IF(ISBLANK('4-PLANTES'!$E$12),\"\",'4-PLANTES'!$E$12)","v":""},null,null,{"$f":"IF(ISBLANK('4-PLANTES'!$E$10),\"\",'4-PLANTES'!$E$10)","v":""},null,{"$f":"VLOOKUP('compilation données pour export'!$R226,'listes valeurs'!$AB$2:$AE$3450,2,FALSE)","v":{"$error":"#N/A"}},{"$f":"'4-PLANTES'!$E$17","v":0},{"$f":"VLOOKUP('compilation données pour export'!$R226,'listes valeurs'!$AB$2:$AE$3450,4,FALSE)","v":{"$error":"#N/A"}},{"$f":"VLOOKUP('compilation données pour export'!$R226,'listes valeurs'!$AB$2:$AE$3450,3,FALSE)","v":{"$error":"#N/A"}},"Présence/absence",{"$f":"IF(ISBLANK('4-PLANTES'!$E$30),\"\",'4-PLANTES'!$E$30)","v":""},"in",{"$f":"'Synthese Annuelle Monitoring'!$Q$39","v":0}]
[{"$f":"'0-INFOS GENERALES A REMPLIR'!$B$4","v":2021},{"$f":"'0-INFOS GENERALES A REMPLIR'!$B$6","v":0},{"$f":"'0-INFOS GENERALES A REMPLIR'!$E$12","v":""},null,null,null,{"$f":"IF(ISBLANK('4-PLANTES'!$A$31),\"\",'4-PLANTES'!$A$31)","v":""},"",{"$f":"IF(ISBLANK('4-PLANTES'!$E$6),\"\",'4-PLANTES'!$E$6)","v":0},{"$f":"IF(ISBLANK('4-PLANTES'!$E$8),\"\",'4-PLANTES'!$E$8)","v":0},null,{"$f":"IF(ISBLANK('4-PLANTES'!$E$12),\"\",'4-PLANTES'!$E$12)","v":""},null,null,{"$f":"IF(ISBLANK('4-PLANTES'!$E$10),\"\",'4-PLANTES'!$E$10)","v":""},null,{"$f":"VLOOKUP('compilation données pour export'!$R227,'listes valeurs'!$AB$2:$AE$3450,2,FALSE)","v":{"$error":"#N/A"}},{"$f":"'4-PLANTES'!$E$17","v":0},{"$f":"VLOOKUP('compilation données pour export'!$R227,'listes valeurs'!$AB$2:$AE$3450,4,FALSE)","v":{"$error":"#N/A"}},{"$f":"VLOOKUP('compilation données pour export'!$R227,'listes valeurs'!$AB$2:$AE$3450,3,FALSE)","v":{"$error":"#N/A"}},"Présence/absence",{"$f":"IF(ISBLANK('4-PLANTES'!$E$31),\"\",'4-PLANTES'!$E$31)","v":""},"in",{"$f":"'Synthese Annuelle Monitoring'!$Q$39","v":0}]
[{"$f":"'0-INFOS GENERALES A REMPLIR'!$B$4","v":2021},{"$f":"'0-INFOS GENERALES A REMPLIR'!$B$6","v":0},{"$f":"'0-INFOS GENERALES A REMPLIR'!$E$12","v":""},null,null,null,{"$f":"IF(ISBLANK('4-PLANTES'!$A$32),\"\",'4-PLANTES'!$A$32)","v":""},"",{"$f":"IF(ISBLANK('4-PLANTES'!$E$6),\"\",'4-PLANTES'!$E$6)","v":0},{"$f":"IF(ISBLANK('4-PLANTES'!$E$8),\"\",'4-PLANTES'!$E$8)","v":0},null,{"$f":"IF(ISBLANK('4-PLANTES'!$E$12),\"\",'4-PLANTES'!$E$12)","v":""},null,null,{"$f":"IF(ISBLANK('4-PLANTES'!$E$10),\"\",'4-PLANTES'!$E$10)","v":""},null,{"$f":"VLOOKUP('compilation données pour export'!$R228,'listes valeurs'!$AB$2:$AE$3450,2,FALSE)","v":{"$error":"#N/A"}},{"$f":"'4-PLANTES'!$E$17","v":0},{"$f":"VLOOKUP('compilation données pour export'!$R228,'listes valeurs'!$AB$2:$AE$3450,4,FALSE)","v":{"$error":"#N/A"}},{"$f":"VLOOKUP('compilation données pour export'!$R228,'listes valeurs'!$AB$2:$AE$3450,3,FALSE)","v":{"$error":"#N/A"}},"Présence/absence",{"$f":"IF(ISBLANK('4-PLANTES'!$E$32),\"\",'4-PLANTES'!$E$32)","v":""},"in",{"$f":"'Synthese Annuelle Monitoring'!$Q$39","v":0}]
[{"$f":"'0-INFOS GENERALES A REMPLIR'!$B$4","v":2021},{"$f":"'0-INFOS GENERALES A REMPLIR'!$B$6","v":0},{"$f":"'0-INFOS GENERALES A REMPLIR'!$E$12","v":""},null,null,null,null,null,{"$f":"IF(ISBLANK('4-PLANTES'!$E$6),\"\",'4-PLANTES'!$E$6)","v":0},{"$f":"IF(ISBLANK('4-PLANTES'!$E$8),\"\",'4-PLANTES'!$E$8)","v":0},null,{"$f":"IF(ISBLANK('4-PLANTES'!$E$12),\"\",'4-PLANTES'!$E$12)","v":""},null,null,{"$f":"IF(ISBLANK('4-PLANTES'!$E$10),\"\",'4-PLANTES'!$E$10)","v":""},null,{"$f":"VLOOKUP('compilation données pour export'!$R229,'listes valeurs'!$AB$2:$AE$3450,2,FALSE)","v":{"$error":"#N/A"}},{"$f":"'4-PLANTES'!$E$17","v":0},{"$f":"VLOOKUP('compilation données pour export'!$R229,'listes valeurs'!$AB$2:$AE$3450,4,FALSE)","v":{"$error":"#N/A"}},{"$f":"VLOOKUP('compilation données pour export'!$R229,'listes valeurs'!$AB$2:$AE$3450,3,FALSE)","v":{"$error":"#N/A"}},"Présence/absence",{"$f":"IF(ISBLANK('4-PLANTES'!$E$35),\"\",IF('4-PLANTES'!$E$35=\"non\",0,IF('4-PLANTES'!$E$35=\"oui\",1,\"erreur de saisie\")))","v":""},"out",{"$f":"'Synthese Annuelle Monitoring'!$Q$39","v":0}]
[{"$f":"'0-INFOS GENERALES A REMPLIR'!$B$4","v":2021},{"$f":"'0-INFOS GENERALES A REMPLIR'!$B$6","v":0},{"$f":"'0-INFOS GENERALES A REMPLIR'!$E$12","v":""},null,null,null,null,null,{"$f":"IF(ISBLANK('4-PLANTES'!$E$6),\"\",'4-PLANTES'!$E$6)","v":0},{"$f":"IF(ISBLANK('4-PLANTES'!$E$8),\"\",'4-PLANTES'!$E$8)","v":0},null,{"$f":"IF(ISBLANK('4-PLANTES'!$E$12),\"\",'4-PLANTES'!$E$12)","v":""},null,null,{"$f":"IF(ISBLANK('4-PLANTES'!$E$10),\"\",'4-PLANTES'!$E$10)","v":""},null,{"$f":"VLOOKUP('compilation données pour export'!$R230,'listes valeurs'!$AB$2:$AE$3450,2,FALSE)","v":{"$error":"#N/A"}},{"$f":"'4-PLANTES'!$E$17","v":0},{"$f":"VLOOKUP('compilation données pour export'!$R230,'listes valeurs'!$AB$2:$AE$3450,4,FALSE)","v":{"$error":"#N/A"}},{"$f":"VLOOKUP('compilation données pour export'!$R230,'listes valeurs'!$AB$2:$AE$3450,3,FALSE)","v":{"$error":"#N/A"}},"Nb parcelles SPB positives",{"$f":"IF('4-PLANTES'!$E$33=0,\"\",'4-PLANTES'!$E$33)","v":""},"in",{"$f":"'Synthese Annuelle Monitoring'!$Q$39","v":0}]
[{"$f":"'0-INFOS GENERALES A REMPLIR'!$B$4","v":2021},{"$f":"'0-INFOS GENERALES A REMPLIR'!$B$6","v":0},{"$f":"'0-INFOS GENERALES A REMPLIR'!$E$12","v":""},null,null,null,null,null,{"$f":"IF(ISBLANK('4-PLANTES'!$E$6),\"\",'4-PLANTES'!$E$6)","v":0},{"$f":"IF(ISBLANK('4-PLANTES'!$E$8),\"\",'4-PLANTES'!$E$8)","v":0},null,{"$f":"IF(ISBLANK('4-PLANTES'!$E$12),\"\",'4-PLANTES'!$E$12)","v":""},null,null,{"$f":"IF(ISBLANK('4-PLANTES'!$E$10),\"\",'4-PLANTES'!$E$10)","v":""},null,{"$f":"VLOOKUP('compilation données pour export'!$R231,'listes valeurs'!$AB$2:$AE$3450,2,FALSE)","v":{"$error":"#N/A"}},{"$f":"'4-PLANTES'!$E$17","v":0},{"$f":"VLOOKUP('compilation données pour export'!$R231,'listes valeurs'!$AB$2:$AE$3450,4,FALSE)","v":{"$error":"#N/A"}},{"$f":"VLOOKUP('compilation données pour export'!$R231,'listes valeurs'!$AB$2:$AE$3450,3,FALSE)","v":{"$error":"#N/A"}},"% présence dans SPB * ",{"$f":"IF('4-PLANTES'!$B$33=0,\"\",COUNTIF(V214:V228,1)/COUNTIF(V214:V228,\">-1\"))","v":""},"in",{"$f":"'Synthese Annuelle Monitoring'!$Q$39","v":0}]
[{"$f":"'0-INFOS GENERALES A REMPLIR'!$B$4","v":2021},{"$f":"'0-INFOS GENERALES A REMPLIR'!$B$6","v":0},{"$f":"'0-INFOS GENERALES A REMPLIR'!$E$12","v":""},null,null,null,{"$f":"IF(ISBLANK('4-PLANTES'!$A$18),\"\",'4-PLANTES'!$A$18)","v":""},{"$f":"IF(G232=\"\",\"\",CONCATENATE(C232,\"_\",G232))","v":""},{"$f":"IF(ISBLANK('4-PLANTES'!$E$6),\"\",'4-PLANTES'!$E$6)","v":0},{"$f":"IF(ISBLANK('4-PLANTES'!$E$8),\"\",'4-PLANTES'!$E$8)","v":0},null,{"$f":"IF(ISBLANK('4-PLANTES'!$E$12),\"\",'4-PLANTES'!$E$12)","v":""},null,null,{"$f":"IF(ISBLANK('4-PLANTES'!$E$10),\"\",'4-PLANTES'!$E$10)","v":""},null,{"$f":"VLOOKUP('compilation données pour export'!$R232,'listes valeurs'!$AB$2:$AE$3450,2,FALSE)","v":{"$error":"#N/A"}},{"$f":"'4-PLANTES'!$F$17","v":0},{"$f":"VLOOKUP('compilation données pour export'!$R232,'listes valeurs'!$AB$2:$AE$3450,4,FALSE)","v":{"$error":"#N/A"}},{"$f":"VLOOKUP('compilation données pour export'!$R232,'listes valeurs'!$AB$2:$AE$3450,3,FALSE)","v":{"$error":"#N/A"}},"Présence/absence",{"$f":"IF(ISBLANK('4-PLANTES'!$F$18),\"\",'4-PLANTES'!$F$18)","v":""},"in",{"$f":"'Synthese Annuelle Monitoring'!$Q$40","v":0}]
[{"$f":"'0-INFOS GENERALES A REMPLIR'!$B$4","v":2021},{"$f":"'0-INFOS GENERALES A REMPLIR'!$B$6","v":0},{"$f":"'0-INFOS GENERALES A REMPLIR'!$E$12","v":""},null,null,null,{"$f":"IF(ISBLANK('4-PLANTES'!$A$19),\"\",'4-PLANTES'!$A$19)","v":""},"",{"$f":"IF(ISBLANK('4-PLANTES'!$E$6),\"\",'4-PLANTES'!$E$6)","v":0},{"$f":"IF(ISBLANK('4-PLANTES'!$E$8),\"\",'4-PLANTES'!$E$8)","v":0},null,{"$f":"IF(ISBLANK('4-PLANTES'!$E$12),\"\",'4-PLANTES'!$E$12)","v":""},null,null,{"$f":"IF(ISBLANK('4-PLANTES'!$E$10),\"\",'4-PLANTES'!$E$10)","v":""},null,{"$f":"VLOOKUP('compilation données pour export'!$R233,'listes valeurs'!$AB$2:$AE$3450,2,FALSE)","v":{"$error":"#N/A"}},{"$f":"'4-PLANTES'!$F$17","v":0},{"$f":"VLOOKUP('compilation données pour export'!$R233,'listes valeurs'!$AB$2:$AE$3450,4,FALSE)","v":{"$error":"#N/A"}},{"$f":"VLOOKUP('compilation données pour export'!$R233,'listes valeurs'!$AB$2:$AE$3450,3,FALSE)","v":{"$error":"#N/A"}},"Présence/absence",{"$f":"IF(ISBLANK('4-PLANTES'!$F$19),\"\",'4-PLANTES'!$F$19)","v":""},"in",{"$f":"'Synthese Annuelle Monitoring'!$Q$40","v":0}]
[{"$f":"'0-INFOS GENERALES A REMPLIR'!$B$4","v":2021},{"$f":"'0-INFOS GENERALES A REMPLIR'!$B$6","v":0},{"$f":"'0-INFOS GENERALES A REMPLIR'!$E$12","v":""},null,null,null,{"$f":"IF(ISBLANK('4-PLANTES'!$A$20),\"\",'4-PLANTES'!$A$20)","v":""},"",{"$f":"IF(ISBLANK('4-PLANTES'!$E$6),\"\",'4-PLANTES'!$E$6)","v":0},{"$f":"IF(ISBLANK('4-PLANTES'!$E$8),\"\",'4-PLANTES'!$E$8)","v":0},null,{"$f":"IF(ISBLANK('4-PLANTES'!$E$12),\"\",'4-PLANTES'!$E$12)","v":""},null,null,{"$f":"IF(ISBLANK('4-PLANTES'!$E$10),\"\",'4-PLANTES'!$E$10)","v":""},null,{"$f":"VLOOKUP('compilation données pour export'!$R234,'listes valeurs'!$AB$2:$AE$3450,2,FALSE)","v":{"$error":"#N/A"}},{"$f":"'4-PLANTES'!$F$17","v":0},{"$f":"VLOOKUP('compilation données pour export'!$R234,'listes valeurs'!$AB$2:$AE$3450,4,FALSE)","v":{"$error":"#N/A"}},{"$f":"VLOOKUP('compilation données pour export'!$R234,'listes valeurs'!$AB$2:$AE$3450,3,FALSE)","v":{"$error":"#N/A"}},"Présence/absence",{"$f":"IF(ISBLANK('4-PLANTES'!$F$20),\"\",'4-PLANTES'!$F$20)","v":""},"in",{"$f":"'Synthese Annuelle Monitoring'!$Q$40","v":0}]
[{"$f":"'0-INFOS GENERALES A REMPLIR'!$B$4","v":2021},{"$f":"'0-INFOS GENERALES A REMPLIR'!$B$6","v":0},{"$f":"'0-INFOS GENERALES A REMPLIR'!$E$12","v":""},null,null,null,{"$f":"IF(ISBLANK('4-PLANTES'!$A$21),\"\",'4-PLANTES'!$A$21)","v":""},"",{"$f":"IF(ISBLANK('4-PLANTES'!$E$6),\"\",'4-PLANTES'!$E$6)","v":0},{"$f":"IF(ISBLANK('4-PLANTES'!$E$8),\"\",'4-PLANTES'!$E$8)","v":0},null,{"$f":"IF(ISBLANK('4-PLANTES'!$E$12),\"\",'4-PLANTES'!$E$12)","v":""},null,null,{"$f":"IF(ISBLANK('4-PLANTES'!$E$10),\"\",'4-PLANTES'!$E$10)","v":""},null,{"$f":"VLOOKUP('compilation données pour export'!$R235,'listes valeurs'!$AB$2:$AE$3450,2,FALSE)","v":{"$error":"#N/A"}},{"$f":"'4-PLANTES'!$F$17","v":0},{"$f":"VLOOKUP('compilation données pour export'!$R235,'listes valeurs'!$AB$2:$AE$3450,4,FALSE)","v":{"$error":"#N/A"}},{"$f":"VLOOKUP('compilation données pour export'!$R235,'listes valeurs'!$AB$2:$AE$3450,3,FALSE)","v":{"$error":"#N/A"}},"Présence/absence",{"$f":"IF(ISBLANK('4-PLANTES'!$F$21),\"\",'4-PLANTES'!$F$21)","v":""},"in",{"$f":"'Synthese Annuelle Monitoring'!$Q$40","v":0}]
[{"$f":"'0-INFOS GENERALES A REMPLIR'!$B$4","v":2021},{"$f":"'0-INFOS GENERALES A REMPLIR'!$B$6","v":0},{"$f":"'0-INFOS GENERALES A REMPLIR'!$E$12","v":""},null,null,null,{"$f":"IF(ISBLANK('4-PLANTES'!$A$22),\"\",'4-PLANTES'!$A$22)","v":""},"",{"$f":"IF(ISBLANK('4-PLANTES'!$E$6),\"\",'4-PLANTES'!$E$6)","v":0},{"$f":"IF(ISBLANK('4-PLANTES'!$E$8),\"\",'4-PLANTES'!$E$8)","v":0},null,{"$f":"IF(ISBLANK('4-PLANTES'!$E$12),\"\",'4-PLANTES'!$E$12)","v":""},null,null,{"$f":"IF(ISBLANK('4-PLANTES'!$E$10),\"\",'4-PLANTES'!$E$10)","v":""},null,{"$f":"VLOOKUP('compilation données pour export'!$R236,'listes valeurs'!$AB$2:$AE$3450,2,FALSE)","v":{"$error":"#N/A"}},{"$f":"'4-PLANTES'!$F$17","v":0},{"$f":"VLOOKUP('compilation données pour export'!$R236,'listes valeurs'!$AB$2:$AE$3450,4,FALSE)","v":{"$error":"#N/A"}},{"$f":"VLOOKUP('compilation données pour export'!$R236,'listes valeurs'!$AB$2:$AE$3450,3,FALSE)","v":{"$error":"#N/A"}},"Présence/absence",{"$f":"IF(ISBLANK('4-PLANTES'!$F$22),\"\",'4-PLANTES'!$F$22)","v":""},"in",{"$f":"'Synthese Annuelle Monitoring'!$Q$40","v":0}]
[{"$f":"'0-INFOS GENERALES A REMPLIR'!$B$4","v":2021},{"$f":"'0-INFOS GENERALES A REMPLIR'!$B$6","v":0},{"$f":"'0-INFOS GENERALES A REMPLIR'!$E$12","v":""},null,null,null,{"$f":"IF(ISBLANK('4-PLANTES'!$A$23),\"\",'4-PLANTES'!$A$23)","v":""},"",{"$f":"IF(ISBLANK('4-PLANTES'!$E$6),\"\",'4-PLANTES'!$E$6)","v":0},{"$f":"IF(ISBLANK('4-PLANTES'!$E$8),\"\",'4-PLANTES'!$E$8)","v":0},null,{"$f":"IF(ISBLANK('4-PLANTES'!$E$12),\"\",'4-PLANTES'!$E$12)","v":""},null,null,{"$f":"IF(ISBLANK('4-PLANTES'!$E$10),\"\",'4-PLANTES'!$E$10)","v":""},null,{"$f":"VLOOKUP('compilation données pour export'!$R237,'listes valeurs'!$AB$2:$AE$3450,2,FALSE)","v":{"$error":"#N/A"}},{"$f":"'4-PLANTES'!$F$17","v":0},{"$f":"VLOOKUP('compilation données pour export'!$R237,'listes valeurs'!$AB$2:$AE$3450,4,FALSE)","v":{"$error":"#N/A"}},{"$f":"VLOOKUP('compilation données pour export'!$R237,'listes valeurs'!$AB$2:$AE$3450,3,FALSE)","v":{"$error":"#N/A"}},"Présence/absence",{"$f":"IF(ISBLANK('4-PLANTES'!$F$23),\"\",'4-PLANTES'!$F$23)","v":""},"in",{"$f":"'Synthese Annuelle Monitoring'!$Q$40","v":0}]
[{"$f":"'0-INFOS GENERALES A REMPLIR'!$B$4","v":2021},{"$f":"'0-INFOS GENERALES A REMPLIR'!$B$6","v":0},{"$f":"'0-INFOS GENERALES A REMPLIR'!$E$12","v":""},null,null,null,{"$f":"IF(ISBLANK('4-PLANTES'!$A$24),\"\",'4-PLANTES'!$A$24)","v":""},"",{"$f":"IF(ISBLANK('4-PLANTES'!$E$6),\"\",'4-PLANTES'!$E$6)","v":0},{"$f":"IF(ISBLANK('4-PLANTES'!$E$8),\"\",'4-PLANTES'!$E$8)","v":0},null,{"$f":"IF(ISBLANK('4-PLANTES'!$E$12),\"\",'4-PLANTES'!$E$12)","v":""},null,null,{"$f":"IF(ISBLANK('4-PLANTES'!$E$10),\"\",'4-PLANTES'!$E$10)","v":""},null,{"$f":"VLOOKUP('compilation données pour export'!$R238,'listes valeurs'!$AB$2:$AE$3450,2,FALSE)","v":{"$error":"#N/A"}},{"$f":"'4-PLANTES'!$F$17","v":0},{"$f":"VLOOKUP('compilation données pour export'!$R238,'listes valeurs'!$AB$2:$AE$3450,4,FALSE)","v":{"$error":"#N/A"}},{"$f":"VLOOKUP('compilation données pour export'!$R238,'listes valeurs'!$AB$2:$AE$3450,3,FALSE)","v":{"$error":"#N/A"}},"Présence/absence",{"$f":"IF(ISBLANK('4-PLANTES'!$F$24),\"\",'4-PLANTES'!$F$24)","v":""},"in",{"$f":"'Synthese Annuelle Monitoring'!$Q$40","v":0}]
[{"$f":"'0-INFOS GENERALES A REMPLIR'!$B$4","v":2021},{"$f":"'0-INFOS GENERALES A REMPLIR'!$B$6","v":0},{"$f":"'0-INFOS GENERALES A REMPLIR'!$E$12","v":""},null,null,null,{"$f":"IF(ISBLANK('4-PLANTES'!$A$25),\"\",'4-PLANTES'!$A$25)","v":""},"",{"$f":"IF(ISBLANK('4-PLANTES'!$E$6),\"\",'4-PLANTES'!$E$6)","v":0},{"$f":"IF(ISBLANK('4-PLANTES'!$E$8),\"\",'4-PLANTES'!$E$8)","v":0},null,{"$f":"IF(ISBLANK('4-PLANTES'!$E$12),\"\",'4-PLANTES'!$E$12)","v":""},null,null,{"$f":"IF(ISBLANK('4-PLANTES'!$E$10),\"\",'4-PLANTES'!$E$10)","v":""},null,{"$f":"VLOOKUP('compilation données pour export'!$R239,'listes valeurs'!$AB$2:$AE$3450,2,FALSE)","v":{"$error":"#N/A"}},{"$f":"'4-PLANTES'!$F$17","v":0},{"$f":"VLOOKUP('compilation données pour export'!$R239,'listes valeurs'!$AB$2:$AE$3450,4,FALSE)","v":{"$error":"#N/A"}},{"$f":"VLOOKUP('compilation données pour export'!$R239,'listes valeurs'!$AB$2:$AE$3450,3,FALSE)","v":{"$error":"#N/A"}},"Présence/absence",{"$f":"IF(ISBLANK('4-PLANTES'!$F$25),\"\",'4-PLANTES'!$F$25)","v":""},"in",{"$f":"'Synthese Annuelle Monitoring'!$Q$40","v":0}]
[{"$f":"'0-INFOS GENERALES A REMPLIR'!$B$4","v":2021},{"$f":"'0-INFOS GENERALES A REMPLIR'!$B$6","v":0},{"$f":"'0-INFOS GENERALES A REMPLIR'!$E$12","v":""},null,null,null,{"$f":"IF(ISBLANK('4-PLANTES'!$A$26),\"\",'4-PLANTES'!$A$26)","v":""},"",{"$f":"IF(ISBLANK('4-PLANTES'!$E$6),\"\",'4-PLANTES'!$E$6)","v":0},{"$f":"IF(ISBLANK('4-PLANTES'!$E$8),\"\",'4-PLANTES'!$E$8)","v":0},null,{"$f":"IF(ISBLANK('4-PLANTES'!$E$12),\"\",'4-PLANTES'!$E$12)","v":""},null,null,{"$f":"IF(ISBLANK('4-PLANTES'!$E$10),\"\",'4-PLANTES'!$E$10)","v":""},null,{"$f":"VLOOKUP('compilation données pour export'!$R240,'listes valeurs'!$AB$2:$AE$3450,2,FALSE)","v":{"$error":"#N/A"}},{"$f":"'4-PLANTES'!$F$17","v":0},{"$f":"VLOOKUP('compilation données pour export'!$R240,'listes valeurs'!$AB$2:$AE$3450,4,FALSE)","v":{"$error":"#N/A"}},{"$f":"VLOOKUP('compilation données pour export'!$R240,'listes valeurs'!$AB$2:$AE$3450,3,FALSE)","v":{"$error":"#N/A"}},"Présence/absence",{"$f":"IF(ISBLANK('4-PLANTES'!$F$26),\"\",'4-PLANTES'!$F$26)","v":""},"in",{"$f":"'Synthese Annuelle Monitoring'!$Q$40","v":0}]
[{"$f":"'0-INFOS GENERALES A REMPLIR'!$B$4","v":2021},{"$f":"'0-INFOS GENERALES A REMPLIR'!$B$6","v":0},{"$f":"'0-INFOS GENERALES A REMPLIR'!$E$12","v":""},null,null,null,{"$f":"IF(ISBLANK('4-PLANTES'!$A$27),\"\",'4-PLANTES'!$A$27)","v":""},"",{"$f":"IF(ISBLANK('4-PLANTES'!$E$6),\"\",'4-PLANTES'!$E$6)","v":0},{"$f":"IF(ISBLANK('4-PLANTES'!$E$8),\"\",'4-PLANTES'!$E$8)","v":0},null,{"$f":"IF(ISBLANK('4-PLANTES'!$E$12),\"\",'4-PLANTES'!$E$12)","v":""},null,null,{"$f":"IF(ISBLANK('4-PLANTES'!$E$10),\"\",'4-PLANTES'!$E$10)","v":""},null,{"$f":"VLOOKUP('compilation données pour export'!$R241,'listes valeurs'!$AB$2:$AE$3450,2,FALSE)","v":{"$error":"#N/A"}},{"$f":"'4-PLANTES'!$F$17","v":0},{"$f":"VLOOKUP('compilation données pour export'!$R241,'listes valeurs'!$AB$2:$AE$3450,4,FALSE)","v":{"$error":"#N/A"}},{"$f":"VLOOKUP('compilation données pour export'!$R241,'listes valeurs'!$AB$2:$AE$3450,3,FALSE)","v":{"$error":"#N/A"}},"Présence/absence",{"$f":"IF(ISBLANK('4-PLANTES'!$F$27),\"\",'4-PLANTES'!$F$27)","v":""},"in",{"$f":"'Synthese Annuelle Monitoring'!$Q$40","v":0}]
[{"$f":"'0-INFOS GENERALES A REMPLIR'!$B$4","v":2021},{"$f":"'0-INFOS GENERALES A REMPLIR'!$B$6","v":0},{"$f":"'0-INFOS GENERALES A REMPLIR'!$E$12","v":""},null,null,null,{"$f":"IF(ISBLANK('4-PLANTES'!$A$28),\"\",'4-PLANTES'!$A$28)","v":""},"",{"$f":"IF(ISBLANK('4-PLANTES'!$E$6),\"\",'4-PLANTES'!$E$6)","v":0},{"$f":"IF(ISBLANK('4-PLANTES'!$E$8),\"\",'4-PLANTES'!$E$8)","v":0},null,{"$f":"IF(ISBLANK('4-PLANTES'!$E$12),\"\",'4-PLANTES'!$E$12)","v":""},null,null,{"$f":"IF(ISBLANK('4-PLANTES'!$E$10),\"\",'4-PLANTES'!$E$10)","v":""},null,{"$f":"VLOOKUP('compilation données pour export'!$R242,'listes valeurs'!$AB$2:$AE$3450,2,FALSE)","v":{"$error":"#N/A"}},{"$f":"'4-PLANTES'!$F$17","v":0},{"$f":"VLOOKUP('compilation données pour export'!$R242,'listes valeurs'!$AB$2:$AE$3450,4,FALSE)","v":{"$error":"#N/A"}},{"$f":"VLOOKUP('compilation données pour export'!$R242,'listes valeurs'!$AB$2:$AE$3450,3,FALSE)","v":{"$error":"#N/A"}},"Présence/absence",{"$f":"IF(ISBLANK('4-PLANTES'!$F$28),\"\",'4-PLANTES'!$F$28)","v":""},"in",{"$f":"'Synthese Annuelle Monitoring'!$Q$40","v":0}]
[{"$f":"'0-INFOS GENERALES A REMPLIR'!$B$4","v":2021},{"$f":"'0-INFOS GENERALES A REMPLIR'!$B$6","v":0},{"$f":"'0-INFOS GENERALES A REMPLIR'!$E$12","v":""},null,null,null,{"$f":"IF(ISBLANK('4-PLANTES'!$A$29),\"\",'4-PLANTES'!$A$29)","v":""},"",{"$f":"IF(ISBLANK('4-PLANTES'!$E$6),\"\",'4-PLANTES'!$E$6)","v":0},{"$f":"IF(ISBLANK('4-PLANTES'!$E$8),\"\",'4-PLANTES'!$E$8)","v":0},null,{"$f":"IF(ISBLANK('4-PLANTES'!$E$12),\"\",'4-PLANTES'!$E$12)","v":""},null,null,{"$f":"IF(ISBLANK('4-PLANTES'!$E$10),\"\",'4-PLANTES'!$E$10)","v":""},null,{"$f":"VLOOKUP('compilation données pour export'!$R243,'listes valeurs'!$AB$2:$AE$3450,2,FALSE)","v":{"$error":"#N/A"}},{"$f":"'4-PLANTES'!$F$17","v":0},{"$f":"VLOOKUP('compilation données pour export'!$R243,'listes valeurs'!$AB$2:$AE$3450,4,FALSE)","v":{"$error":"#N/A"}},{"$f":"VLOOKUP('compilation données pour export'!$R243,'listes valeurs'!$AB$2:$AE$3450,3,FALSE)","v":{"$error":"#N/A"}},"Présence/absence",{"$f":"IF(ISBLANK('4-PLANTES'!$F$29),\"\",'4-PLANTES'!$F$29)","v":""},"in",{"$f":"'Synthese Annuelle Monitoring'!$Q$40","v":0}]
[{"$f":"'0-INFOS GENERALES A REMPLIR'!$B$4","v":2021},{"$f":"'0-INFOS GENERALES A REMPLIR'!$B$6","v":0},{"$f":"'0-INFOS GENERALES A REMPLIR'!$E$12","v":""},null,null,null,{"$f":"IF(ISBLANK('4-PLANTES'!$A$30),\"\",'4-PLANTES'!$A$30)","v":""},"",{"$f":"IF(ISBLANK('4-PLANTES'!$E$6),\"\",'4-PLANTES'!$E$6)","v":0},{"$f":"IF(ISBLANK('4-PLANTES'!$E$8),\"\",'4-PLANTES'!$E$8)","v":0},null,{"$f":"IF(ISBLANK('4-PLANTES'!$E$12),\"\",'4-PLANTES'!$E$12)","v":""},null,null,{"$f":"IF(ISBLANK('4-PLANTES'!$E$10),\"\",'4-PLANTES'!$E$10)","v":""},null,{"$f":"VLOOKUP('compilation données pour export'!$R244,'listes valeurs'!$AB$2:$AE$3450,2,FALSE)","v":{"$error":"#N/A"}},{"$f":"'4-PLANTES'!$F$17","v":0},{"$f":"VLOOKUP('compilation données pour export'!$R244,'listes valeurs'!$AB$2:$AE$3450,4,FALSE)","v":{"$error":"#N/A"}},{"$f":"VLOOKUP('compilation données pour export'!$R244,'listes valeurs'!$AB$2:$AE$3450,3,FALSE)","v":{"$error":"#N/A"}},"Présence/absence",{"$f":"IF(ISBLANK('4-PLANTES'!$F$30),\"\",'4-PLANTES'!$F$30)","v":""},"in",{"$f":"'Synthese Annuelle Monitoring'!$Q$40","v":0}]
[{"$f":"'0-INFOS GENERALES A REMPLIR'!$B$4","v":2021},{"$f":"'0-INFOS GENERALES A REMPLIR'!$B$6","v":0},{"$f":"'0-INFOS GENERALES A REMPLIR'!$E$12","v":""},null,null,null,{"$f":"IF(ISBLANK('4-PLANTES'!$A$31),\"\",'4-PLANTES'!$A$31)","v":""},"",{"$f":"IF(ISBLANK('4-PLANTES'!$E$6),\"\",'4-PLANTES'!$E$6)","v":0},{"$f":"IF(ISBLANK('4-PLANTES'!$E$8),\"\",'4-PLANTES'!$E$8)","v":0},null,{"$f":"IF(ISBLANK('4-PLANTES'!$E$12),\"\",'4-PLANTES'!$E$12)","v":""},null,null,{"$f":"IF(ISBLANK('4-PLANTES'!$E$10),\"\",'4-PLANTES'!$E$10)","v":""},null,{"$f":"VLOOKUP('compilation données pour export'!$R245,'listes valeurs'!$AB$2:$AE$3450,2,FALSE)","v":{"$error":"#N/A"}},{"$f":"'4-PLANTES'!$F$17","v":0},{"$f":"VLOOKUP('compilation données pour export'!$R245,'listes valeurs'!$AB$2:$AE$3450,4,FALSE)","v":{"$error":"#N/A"}},{"$f":"VLOOKUP('compilation données pour export'!$R245,'listes valeurs'!$AB$2:$AE$3450,3,FALSE)","v":{"$error":"#N/A"}},"Présence/absence",{"$f":"IF(ISBLANK('4-PLANTES'!$F$31),\"\",'4-PLANTES'!$F$31)","v":""},"in",{"$f":"'Synthese Annuelle Monitoring'!$Q$40","v":0}]
[{"$f":"'0-INFOS GENERALES A REMPLIR'!$B$4","v":2021},{"$f":"'0-INFOS GENERALES A REMPLIR'!$B$6","v":0},{"$f":"'0-INFOS GENERALES A REMPLIR'!$E$12","v":""},null,null,null,{"$f":"IF(ISBLANK('4-PLANTES'!$A$32),\"\",'4-PLANTES'!$A$32)","v":""},"",{"$f":"IF(ISBLANK('4-PLANTES'!$E$6),\"\",'4-PLANTES'!$E$6)","v":0},{"$f":"IF(ISBLANK('4-PLANTES'!$E$8),\"\",'4-PLANTES'!$E$8)","v":0},null,{"$f":"IF(ISBLANK('4-PLANTES'!$E$12),\"\",'4-PLANTES'!$E$12)","v":""},null,null,{"$f":"IF(ISBLANK('4-PLANTES'!$E$10),\"\",'4-PLANTES'!$E$10)","v":""},null,{"$f":"VLOOKUP('compilation données pour export'!$R246,'listes valeurs'!$AB$2:$AE$3450,2,FALSE)","v":{"$error":"#N/A"}},{"$f":"'4-PLANTES'!$F$17","v":0},{"$f":"VLOOKUP('compilation données pour export'!$R246,'listes valeurs'!$AB$2:$AE$3450,4,FALSE)","v":{"$error":"#N/A"}},{"$f":"VLOOKUP('compilation données pour export'!$R246,'listes valeurs'!$AB$2:$AE$3450,3,FALSE)","v":{"$error":"#N/A"}},"Présence/absence",{"$f":"IF(ISBLANK('4-PLANTES'!$F$32),\"\",'4-PLANTES'!$F$32)","v":""},"in",{"$f":"'Synthese Annuelle Monitoring'!$Q$40","v":0}]
[{"$f":"'0-INFOS GENERALES A REMPLIR'!$B$4","v":2021},{"$f":"'0-INFOS GENERALES A REMPLIR'!$B$6","v":0},{"$f":"'0-INFOS GENERALES A REMPLIR'!$E$12","v":""},null,null,null,null,null,{"$f":"IF(ISBLANK('4-PLANTES'!$E$6),\"\",'4-PLANTES'!$E$6)","v":0},{"$f":"IF(ISBLANK('4-PLANTES'!$E$8),\"\",'4-PLANTES'!$E$8)","v":0},null,{"$f":"IF(ISBLANK('4-PLANTES'!$E$12),\"\",'4-PLANTES'!$E$12)","v":""},null,null,{"$f":"IF(ISBLANK('4-PLANTES'!$E$10),\"\",'4-PLANTES'!$E$10)","v":""},null,{"$f":"VLOOKUP('compilation données pour export'!$R247,'listes valeurs'!$AB$2:$AE$3450,2,FALSE)","v":{"$error":"#N/A"}},{"$f":"'4-PLANTES'!$F$17","v":0},{"$f":"VLOOKUP('compilation données pour export'!$R247,'listes valeurs'!$AB$2:$AE$3450,4,FALSE)","v":{"$error":"#N/A"}},{"$f":"VLOOKUP('compilation données pour export'!$R247,'listes valeurs'!$AB$2:$AE$3450,3,FALSE)","v":{"$error":"#N/A"}},"Présence/absence",{"$f":"IF(ISBLANK('4-PLANTES'!$F$35),\"\",IF('4-PLANTES'!$F$35=\"non\",0,IF('4-PLANTES'!$F$35=\"oui\",1,\"erreur de saisie\")))","v":""},"out",{"$f":"'Synthese Annuelle Monitoring'!$Q$40","v":0}]
[{"$f":"'0-INFOS GENERALES A REMPLIR'!$B$4","v":2021},{"$f":"'0-INFOS GENERALES A REMPLIR'!$B$6","v":0},{"$f":"'0-INFOS GENERALES A REMPLIR'!$E$12","v":""},null,null,null,null,null,{"$f":"IF(ISBLANK('4-PLANTES'!$E$6),\"\",'4-PLANTES'!$E$6)","v":0},{"$f":"IF(ISBLANK('4-PLANTES'!$E$8),\"\",'4-PLANTES'!$E$8)","v":0},null,{"$f":"IF(ISBLANK('4-PLANTES'!$E$12),\"\",'4-PLANTES'!$E$12)","v":""},null,null,{"$f":"IF(ISBLANK('4-PLANTES'!$E$10),\"\",'4-PLANTES'!$E$10)","v":""},null,{"$f":"VLOOKUP('compilation données pour export'!$R248,'listes valeurs'!$AB$2:$AE$3450,2,FALSE)","v":{"$error":"#N/A"}},{"$f":"'4-PLANTES'!$F$17","v":0},{"$f":"VLOOKUP('compilation données pour export'!$R248,'listes valeurs'!$AB$2:$AE$3450,4,FALSE)","v":{"$error":"#N/A"}},{"$f":"VLOOKUP('compilation données pour export'!$R248,'listes valeurs'!$AB$2:$AE$3450,3,FALSE)","v":{"$error":"#N/A"}},"Nb parcelles SPB positives",{"$f":"IF('4-PLANTES'!$F$33=0,\"\",'4-PLANTES'!$F$33)","v":""},"in",{"$f":"'Synthese Annuelle Monitoring'!$Q$40","v":0}]
[{"$f":"'0-INFOS GENERALES A REMPLIR'!$B$4","v":2021},{"$f":"'0-INFOS GENERALES A REMPLIR'!$B$6","v":0},{"$f":"'0-INFOS GENERALES A REMPLIR'!$E$12","v":""},null,null,null,null,null,{"$f":"IF(ISBLANK('4-PLANTES'!$E$6),\"\",'4-PLANTES'!$E$6)","v":0},{"$f":"IF(ISBLANK('4-PLANTES'!$E$8),\"\",'4-PLANTES'!$E$8)","v":0},null,{"$f":"IF(ISBLANK('4-PLANTES'!$E$12),\"\",'4-PLANTES'!$E$12)","v":""},null,null,{"$f":"IF(ISBLANK('4-PLANTES'!$E$10),\"\",'4-PLANTES'!$E$10)","v":""},null,{"$f":"VLOOKUP('compilation données pour export'!$R249,'listes valeurs'!$AB$2:$AE$3450,2,FALSE)","v":{"$error":"#N/A"}},{"$f":"'4-PLANTES'!$F$17","v":0},{"$f":"VLOOKUP('compilation données pour export'!$R249,'listes valeurs'!$AB$2:$AE$3450,4,FALSE)","v":{"$error":"#N/A"}},{"$f":"VLOOKUP('compilation données pour export'!$R249,'listes valeurs'!$AB$2:$AE$3450,3,FALSE)","v":{"$error":"#N/A"}},"% présence dans SPB * ",{"$f":"IF('4-PLANTES'!$B$33=0,\"\",COUNTIF(V232:V246,1)/COUNTIF(V232:V246,\">-1\"))","v":""},"in",{"$f":"'Synthese Annuelle Monitoring'!$Q$40","v":0}]
[{"$f":"'0-INFOS GENERALES A REMPLIR'!$B$4","v":2021},{"$f":"'0-INFOS GENERALES A REMPLIR'!$B$6","v":0},{"$f":"'0-INFOS GENERALES A REMPLIR'!$E$12","v":""},null,null,null,null,null,null,null,null,null,null,null,{"$f":"IF(ISBLANK('5-LEZARD AGILE'!$C$8),\"\",'5-LEZARD AGILE'!$C$8)","v":""},null,{"$f":"VLOOKUP('compilation données pour export'!$R250,'listes valeurs'!$AJ$2:$AM$3450,2,FALSE)","v":"Lézard agile"},{"$f":"'5-LEZARD AGILE'!$A$11","v":"Lacerta agilis"},{"$f":"VLOOKUP('compilation données pour export'!$R250,'listes valeurs'!$AJ$2:$AM$3450,4,FALSE)","v":"Lacerta agilis"},{"$f":"VLOOKUP('compilation données pour export'!$R250,'listes valeurs'!$AJ$2:$AM$3450,3,FALSE)","v":"Reptiles"},"Nbre cumulé de contacts*",{"$f":"'5-LEZARD AGILE'!$C$11","v":0},"in",{"$f":"'Synthese Annuelle Monitoring'!$Q$43","v":0}]
[{"$f":"'0-INFOS GENERALES A REMPLIR'!$B$4","v":2021},{"$f":"'0-INFOS GENERALES A REMPLIR'!$B$6","v":0},{"$f":"'0-INFOS GENERALES A REMPLIR'!$E$12","v":""},null,null,null,null,null,null,null,null,null,null,null,{"$f":"IF(ISBLANK('5-LEZARD AGILE'!$C$8),\"\",'5-LEZARD AGILE'!$C$8)","v":""},null,{"$f":"VLOOKUP('compilation données pour export'!$R251,'listes valeurs'!$AJ$2:$AM$3450,2,FALSE)","v":"Lézard agile"},{"$f":"'5-LEZARD AGILE'!$A$11","v":"Lacerta agilis"},{"$f":"VLOOKUP('compilation données pour export'!$R251,'listes valeurs'!$AJ$2:$AM$3450,4,FALSE)","v":"Lacerta agilis"},{"$f":"VLOOKUP('compilation données pour export'!$R251,'listes valeurs'!$AJ$2:$AM$3450,3,FALSE)","v":"Reptiles"},"Nbre de sites différents **",{"$f":"'5-LEZARD AGILE'!$D$11","v":0},"in",{"$f":"'Synthese Annuelle Monitoring'!$Q$43","v":0}]
[{"$f":"'0-INFOS GENERALES A REMPLIR'!$B$4","v":2021},{"$f":"'0-INFOS GENERALES A REMPLIR'!$B$6","v":0},{"$f":"'0-INFOS GENERALES A REMPLIR'!$E$12","v":""},null,null,null,null,null,null,null,null,null,null,null,{"$f":"IF(ISBLANK('5-LEZARD AGILE'!$C$8),\"\",'5-LEZARD AGILE'!$C$8)","v":""},null,{"$f":"VLOOKUP('compilation données pour export'!$R252,'listes valeurs'!$AJ$2:$AM$3450,2,FALSE)","v":"Lézard agile"},{"$f":"'5-LEZARD AGILE'!$A$11","v":"Lacerta agilis"},{"$f":"VLOOKUP('compilation données pour export'!$R252,'listes valeurs'!$AJ$2:$AM$3450,4,FALSE)","v":"Lacerta agilis"},{"$f":"VLOOKUP('compilation données pour export'!$R252,'listes valeurs'!$AJ$2:$AM$3450,3,FALSE)","v":"Reptiles"},"Présence/absence",{"$f":"IF(ISBLANK('5-LEZARD AGILE'!$C$15),\"\",IF('5-LEZARD AGILE'!$C$15=\"non\",0,IF('5-LEZARD AGILE'!$C$15=\"oui\",1,\"erreur de saisie\")))","v":""},"out",{"$f":"'Synthese Annuelle Monitoring'!$Q$43","v":0}]
[{"$f":"'0-INFOS GENERALES A REMPLIR'!$B$4","v":2021},{"$f":"'0-INFOS GENERALES A REMPLIR'!$B$6","v":0},{"$f":"'0-INFOS GENERALES A REMPLIR'!$E$12","v":""},null,null,null,null,null,null,null,null,null,null,null,{"$f":"IF(ISBLANK('5-LEZARD AGILE'!$C$8),\"\",'5-LEZARD AGILE'!$C$8)","v":""},null,{"$f":"VLOOKUP('compilation données pour export'!$R253,'listes valeurs'!$AJ$2:$AM$3450,2,FALSE)","v":"Lézard agile"},{"$f":"'5-LEZARD AGILE'!$A$11","v":"Lacerta agilis"},{"$f":"VLOOKUP('compilation données pour export'!$R253,'listes valeurs'!$AJ$2:$AM$3450,4,FALSE)","v":"Lacerta agilis"},{"$f":"VLOOKUP('compilation données pour export'!$R253,'listes valeurs'!$AJ$2:$AM$3450,3,FALSE)","v":"Reptiles"},"Nbre km",{"$f":"'5-LEZARD AGILE'!$E$11","v":0},"in",{"$f":"'Synthese Annuelle Monitoring'!$Q$43","v":0}]
[{"$f":"'0-INFOS GENERALES A REMPLIR'!$B$4","v":2021},{"$f":"'0-INFOS GENERALES A REMPLIR'!$B$6","v":0},{"$f":"'0-INFOS GENERALES A REMPLIR'!$E$12","v":""},null,null,null,null,null,null,null,null,null,null,null,{"$f":"IF(ISBLANK('5-LEZARD AGILE'!$C$8),\"\",'5-LEZARD AGILE'!$C$8)","v":""},null,{"$f":"VLOOKUP('compilation données pour export'!$R254,'listes valeurs'!$AJ$2:$AM$3450,2,FALSE)","v":"Lézard agile"},{"$f":"'5-LEZARD AGILE'!$A$11","v":"Lacerta agilis"},{"$f":"VLOOKUP('compilation données pour export'!$R254,'listes valeurs'!$AJ$2:$AM$3450,4,FALSE)","v":"Lacerta agilis"},{"$f":"VLOOKUP('compilation données pour export'!$R254,'listes valeurs'!$AJ$2:$AM$3450,3,FALSE)","v":"Reptiles"},"indice contacts km",{"$f":"$V$250/$V$253","v":{"$error":"#DIV/0!"}},"in",{"$f":"'Synthese Annuelle Monitoring'!$Q$43","v":0}]
[{"$f":"'0-INFOS GENERALES A REMPLIR'!$B$4","v":2021},{"$f":"'0-INFOS GENERALES A REMPLIR'!$B$6","v":0},{"$f":"'0-INFOS GENERALES A REMPLIR'!$E$12","v":""},null,null,null,null,null,null,null,null,null,null,null,{"$f":"IF(ISBLANK('5-LEZARD AGILE'!$C$8),\"\",'5-LEZARD AGILE'!$C$8)","v":""},null,{"$f":"VLOOKUP('compilation données pour export'!$R255,'listes valeurs'!$AJ$2:$AM$3450,2,FALSE)","v":"Lézard agile"},{"$f":"'5-LEZARD AGILE'!$A$11","v":"Lacerta agilis"},{"$f":"VLOOKUP('compilation données pour export'!$R255,'listes valeurs'!$AJ$2:$AM$3450,4,FALSE)","v":"Lacerta agilis"},{"$f":"VLOOKUP('compilation données pour export'!$R255,'listes valeurs'!$AJ$2:$AM$3450,3,FALSE)","v":"Reptiles"},"indice site km",{"$f":"$V$251/$V$253","v":{"$error":"#DIV/0!"}},"in",{"$f":"'Synthese Annuelle Monitoring'!$Q$43","v":0}]
[{"$f":"'0-INFOS GENERALES A REMPLIR'!$B$4","v":2021},{"$f":"'0-INFOS GENERALES A REMPLIR'!$B$6","v":0},{"$f":"'0-INFOS GENERALES A REMPLIR'!$E$12","v":""},null,null,null,null,null,null,null,null,null,null,null,null,null,null,null,null,null,"Nombre agriculteurs participant réseau",{"$f":"'0-INFOS GENERALES A REMPLIR'!$B$8","v":0},"in"]