{"text_format":"1","workbook":"xlsx","n_sheets":12,"sheets":["0-INFOS GENERALES A REMPLIR","1-LIEVRE BRUN","2-OISEAUX","3-PAPILLONS","4-PLANTES","5-LEZARD AGILE","Synthese Annuelle Monitoring","listes valeurs","contrôles","test TCD","listes commentaires","compilation données pour export"],"not_rendered":{"charts":1,"images":1,"macros":1,"external_links":0,"defined_names":15,"comments":1,"pivot_tables":10},"unopened":[],"bounds":{"document_bytes":16777216,"sheet_cells":100000,"rows_first":2000,"rows_last":500,"rows_between":2000,"halvings":0,"cell_chars":16384,"cell_head_chars":4096},"cells_cut":0,"cells_raw":0,"read":"whole","date_system":"1900"}

{"sheet":"0-INFOS GENERALES A REMPLIR","index":0,"n_rows":24,"n_cols":5,"rows_kept":24,"cut":false,"hidden":false,"merged":[[21,0,21,3],[23,0,23,4],[22,0,22,4],[0,0,0,6],[1,0,1,6],[16,0,16,1],[4,4,7,4],[20,0,20,3]]}
["ANNEXE 0 - INFORMATIONS GENERALES A REMPLIR"]
[]
[]
["Année",2021,null,"date de version","2021-05-15"]
[null,null,null,"Nouveautés de l'outil","onglet 0: instructions pour la transmission des données"]
["Nom du Réseau"]
[]
["Nombre d'agriculteurs participant au réseau"]
{"$rows_left_out":17}
{"sheet":"1-LIEVRE BRUN","index":1,"n_rows":28,"n_cols":4,"rows_kept":28,"cut":false,"hidden":false,"merged":[[27,1,35,6],[13,3,13,6],[0,0,0,6],[1,0,1,6],[3,1,3,4],[9,0,9,6],[13,0,13,1],[14,0,14,1],[11,3,11,6]]}
["ANNEXE 1 - FORMULAIRE DE MONITORING"]
["LIEVRE BRUN"]
[]
["Nom du réseau :",{"$f":"'0-INFOS GENERALES A REMPLIR'!B6","v":0}]
[]
["Année de suivi",{"$f":"'0-INFOS GENERALES A REMPLIR'!B4","v":2021}]
[]
["Instructions pour l'enquête \"lièvre\":"]
{"$rows_left_out":21}
{"sheet":"2-OISEAUX","index":2,"n_rows":40,"n_cols":17,"rows_kept":40,"cut":false,"hidden":false,"merged":[[39,1,47,15],[31,2,31,3],[31,5,31,6],[31,8,31,9],[32,2,32,3],[32,5,32,6],[32,8,32,9],[33,2,33,3],[33,5,33,6],[33,8,33,9],[32,14,32,15],[33,14,33,15],[34,14,34,15],[36,14,36,15],[37,14,37,15],[34,2,34,3],[34,5,34,6],[34,8,34,9],[36,2,36,3],[36,5,36,6],[36,8,36,9],[37,2,37,3],[37,5,37,6],[37,8,37,9],[25,0,25,1],[25,2,25,3],[25,5,25,6],[25,8,25,9],[26,2,26,3],[26,5,26,6],[26,8,26,9],[27,2,27,3],[27,5,27,6],[27,8,27,9],[19,2,19,3],[19,5,19,6],[19,8,19,9],[20,2,20,3],[20,5,20,6],[20,8,20,9],[21,2,21,3],[21,5,21,6],[21,8,21,9],[16,2,16,3],[16,5,16,6],[16,8,16,9],[17,2,17,3],[17,5,17,6],[17,8,17,9],[18,2,18,3],[18,5,18,6],[18,8,18,9],[12,2,12,3],[12,5,12,6],[12,8,12,9],[14,2,14,3],[14,5,14,6],[14,8,14,9],[15,2,15,3],[15,5,15,6],[15,8,15,9],[7,11,7,12],[8,11,8,12],[10,11,10,12],[12,11,12,12],[0,0,0,3],[1,0,1,3],[2,0,2,1],[3,2,3,3],[5,2,5,3],[5,5,5,6],[5,8,5,9],[7,0,7,1],[7,2,7,3],[7,5,7,6],[7,8,7,9],[8,0,8,1],[8,2,8,3],[8,5,8,6],[8,8,8,9],[9,0,9,1],[10,0,10,1],[10,2,10,3],[10,5,10,6],[10,8,10,9],[31,11,31,12],[19,11,19,12],[20,11,20,12],[21,11,21,12],[25,11,25,12],[26,11,26,12],[14,11,14,12],[15,11,15,12],[16,11,16,12],[17,11,17,12],[18,11,18,12],[31,14,31,15],[37,11,37,12],[24,2,24,3],[24,5,24,6],[24,8,24,9],[24,11,24,12],[24,14,24,15],[28,2,28,3],[28,5,28,6],[28,8,28,9],[29,2,29,3],[29,5,29,6],[29,8,29,9],[30,2,30,3],[30,5,30,6],[30,8,30,9],[25,14,25,15],[26,14,26,15],[32,11,32,12],[33,11,33,12],[34,11,34,12],[36,11,36,12],[27,11,27,12],[28,11,28,12],[23,2,23,3],[23,5,23,6],[23,8,23,9],[23,11,23,12],[23,14,23,15],[27,14,27,15],[28,14,28,15],[29,14,29,15],[30,14,30,15],[29,11,29,12],[30,11,30,12],[5,4,8,4],[5,7,8,7],[5,10,8,10],[5,13,8,13],[5,16,8,16],[22,2,22,3],[22,5,22,6],[22,8,22,9],[22,11,22,12],[22,14,22,15],[19,14,19,15],[20,14,20,15],[21,14,21,15],[14,14,14,15],[15,14,15,15],[16,14,16,15],[17,14,17,15],[18,14,18,15],[5,14,5,15],[7,14,7,15],[8,14,8,15],[10,14,10,15],[12,14,12,15],[5,11,5,12]]}
["ANNEXE 2 - FORMULAIRE DE MONITORING"]
["OISEAUX"]
[]
[null,"Nom du réseau :",{"$f":"'0-INFOS GENERALES A REMPLIR'!B6","v":0}]
[]
[null,"No du parcours : ",{"$f":"'0-INFOS GENERALES A REMPLIR'!A12","v":0},null,{"$f":"IF(C9<>\"\",IF(OR(C9<DATE('0-INFOS GENERALES A REMPLIR'!B4,'listes valeurs'!K2,'listes valeurs'!J2),C9>DATE('0-INFOS GENERALES A REMPLIR'!B4,'listes valeurs'!K3,'listes valeurs'!J3)),'listes commentaires'!B6,\"\"),\"\")","v":""},{"$f":"'0-INFOS GENERALES A REMPLIR'!A13","v":0},null,{"$f":"IF(F9<>\"\",IF(OR(F9<DATE('0-INFOS GENERALES A REMPLIR'!B4,'listes valeurs'!K2,'listes valeurs'!J2),F9>DATE('0-INFOS GENERALES A REMPLIR'!B4,'listes valeurs'!K3,'listes valeurs'!J3)),'listes commentaires'!B6,\"\"),\"\")","v":""},{"$f":"'0-INFOS GENERALES A REMPLIR'!A14","v":0},null,{"$f":"IF(I9<>\"\",IF(OR(I9<DATE('0-INFOS GENERALES A REMPLIR'!B4,'listes valeurs'!K2,'listes valeurs'!J2),I9>DATE('0-INFOS GENERALES A REMPLIR'!B4,'listes valeurs'!K3,'listes valeurs'!J3)),'listes commentaires'!B6,\"\"),\"\")","v":""},{"$f":"'0-INFOS GENERALES A REMPLIR'!A15","v":0},null,{"$f":"IF(L9<>\"\",IF(OR(L9<DATE('0-INFOS GENERALES A REMPLIR'!B4,'listes valeurs'!K2,'listes valeurs'!J2),L9>DATE('0-INFOS GENERALES A REMPLIR'!B4,'listes valeurs'!K3,'listes valeurs'!J3)),'listes commentaires'!B6,\"\"),\"\")","v":""},{"$f":"'0-INFOS GENERALES A REMPLIR'!A16","v":0},null,{"$f":"IF(O9<>\"\",IF(OR(O9<DATE('0-INFOS GENERALES A REMPLIR'!B4,'listes valeurs'!K2,'listes valeurs'!J2),O9>DATE('0-INFOS GENERALES A REMPLIR'!B4,'listes valeurs'!K3,'listes valeurs'!J3)),'listes commentaires'!B6,\"\"),\"\")","v":""}]
[]
["Conditions météo durant le parcours :"]
{"$rows_left_out":33}
{"sheet":"3-PAPILLONS","index":3,"n_rows":182,"n_cols":10,"rows_kept":182,"cut":false,"hidden":false,"merged":[[181,1,189,8],[94,0,94,1],[106,2,106,3],[106,5,106,6],[106,7,106,8],[107,2,107,3],[107,5,107,6],[107,7,107,8],[110,0,110,1],[111,2,111,6],[113,2,113,6],[117,2,117,3],[117,5,117,6],[115,2,115,6],[118,2,118,3],[118,5,118,6],[82,2,82,3],[82,5,82,6],[83,2,83,3],[83,5,83,6],[86,2,86,3],[86,5,86,6],[74,0,74,1],[75,2,75,6],[77,2,77,6],[81,2,81,3],[81,5,81,6],[79,2,79,6],[58,0,58,1],[70,2,70,3],[70,5,70,6],[70,7,70,8],[71,2,71,3],[71,5,71,6],[71,7,71,8],[46,2,46,3],[46,5,46,6],[47,2,47,3],[47,5,47,6],[50,2,50,3],[50,5,50,6],[38,0,38,1],[39,2,39,6],[41,2,41,6],[43,2,43,6],[45,2,45,3],[45,5,45,6],[22,0,22,1],[34,2,34,3],[34,5,34,6],[34,7,34,8],[35,2,35,3],[35,5,35,6],[35,7,35,8],[130,0,130,1],[0,0,0,8],[1,0,1,8],[2,0,2,1],[3,2,3,6],[5,2,5,6],[7,2,7,6],[9,2,9,3],[9,5,9,6],[10,2,10,3],[10,5,10,6],[9,4,11,4],[11,2,11,3],[11,5,11,6],[14,2,14,3],[14,5,14,6],[143,7,143,8],[119,2,119,3],[119,5,119,6],[122,2,122,3],[122,5,122,6],[166,0,166,1],[147,2,147,6],[149,2,149,6],[153,2,153,3],[153,5,153,6],[154,2,154,3],[154,5,154,6],[151,2,151,6],[9,7,11,7],[178,2,178,3],[178,5,178,6],[178,7,178,8],[179,2,179,3],[179,5,179,6],[179,7,179,8],[155,2,155,3],[155,5,155,6],[158,2,158,3],[158,5,158,6],[142,2,142,3],[142,5,142,6],[142,7,142,8],[143,2,143,3],[143,5,143,6]]}
["ANNEXE 3 - FORMULAIRE DE MONITORING"]
["PAPILLONS"]
[]
[null,"Nom du réseau :",{"$f":"'0-INFOS GENERALES A REMPLIR'!B6","v":0}]
[]
[null,"No du parcours : ",{"$f":"'0-INFOS GENERALES A REMPLIR'!A12","v":0}]
[]
[null,"Nom de l’observateur : "]
{"$rows_left_out":175}
{"sheet":"4-PLANTES","index":4,"n_rows":43,"n_cols":7,"rows_kept":43,"cut":false,"hidden":false,"merged":[[40,0,40,11],[42,0,42,11],[14,0,14,11],[37,2,37,3],[38,2,38,3],[15,6,15,10],[15,1,15,2],[7,4,7,9],[9,4,9,9],[11,4,11,5],[11,6,11,9],[13,0,13,11],[0,0,0,11],[1,0,1,11],[3,4,3,9],[5,0,5,2],[5,4,5,9]]}
["ANNEXE 4 - FORMULAIRE DE MONITORING"]
["PLANTES"]
[]
["Nom du réseau :",null,null,null,{"$f":"'0-INFOS GENERALES A REMPLIR'!B6","v":0}]
[]
["Nombre de parcelles SPB favorables inscrites au réseau*: ",null,null,null,0]
[]
["Nombre de parcelles SPB visitées: ",null,null,null,0]
{"$rows_left_out":36}
{"sheet":"5-LEZARD AGILE","index":5,"n_rows":21,"n_cols":5,"rows_kept":21,"cut":false,"hidden":false,"merged":[[0,0,0,4],[1,0,1,4],[3,2,3,4],[7,2,7,4]]}
["ANNEXE 5 - FORMULAIRE DE MONITORING"]
["LEZARD AGILE"]
[]
["Nom du réseau :",null,{"$f":"'0-INFOS GENERALES A REMPLIR'!B6","v":0}]
[]
["Année de suivi",null,{"$f":"'0-INFOS GENERALES A REMPLIR'!B4","v":2021}]
[]
["Nom de l’observateur : "]
{"$rows_left_out":14}
{"sheet":"Synthese Annuelle Monitoring","index":6,"n_rows":43,"n_cols":17,"rows_kept":43,"cut":false,"hidden":true,"merged":[[21,11,21,12],[22,11,22,12],[23,11,23,12],[24,11,24,12],[25,11,25,12],[16,11,16,12],[17,11,17,12],[18,11,18,12],[19,11,19,12],[20,11,20,12],[21,9,21,10],[23,7,23,8],[23,5,23,6],[24,5,24,6],[25,5,25,6],[24,7,24,8],[25,7,25,8],[22,9,22,10],[23,9,23,10],[24,9,24,10],[25,9,25,10],[16,9,16,10],[17,9,17,10],[18,9,18,10],[19,9,19,10],[20,9,20,10],[15,9,15,10],[15,11,15,12],[9,9,9,10],[9,11,9,12],[8,5,8,12],[10,9,10,10],[10,11,10,12],[17,7,17,8],[18,3,18,4],[18,5,18,6],[18,7,18,8],[19,3,19,4],[19,5,19,6],[35,0,39,0],[20,3,20,4],[20,5,20,6],[20,7,20,8],[21,3,21,4],[21,5,21,6],[21,7,21,8],[22,3,22,4],[22,5,22,6],[22,7,22,8],[28,0,32,0],[16,0,25,0],[23,3,23,4],[24,3,24,4],[25,3,25,4],[17,3,17,4],[10,3,10,4],[10,5,10,6],[10,7,10,8],[19,7,19,8],[12,3,12,4],[12,5,12,6],[12,7,12,8],[13,3,13,4],[13,7,13,8],[15,3,15,4],[15,5,15,6],[15,7,15,8],[16,3,16,4],[16,5,16,6],[16,7,16,8],[17,5,17,6],[0,0,0,14],[1,0,1,14],[3,2,3,5],[5,2,5,5],[9,3,9,4],[9,5,9,6],[9,7,9,8],[3,11,3,12]]}
["ANNEXE 6 - SYNTHESE ANNUELLE DU MONITORING "]
["Suivi des espèces dans les réseaux écologiques"]
[]
["Numéro du réseau: ",null,null,null,null,null,null,"Les données ont été transmises à infospecies?",null,null,null,{"$f":"IF(ISBLANK('0-INFOS GENERALES A REMPLIR'!B19),\"pas d'information\",('0-INFOS GENERALES A REMPLIR'!B19))","v":"pas d'information"}]
[]
["Nom du réseau: ",null,{"$f":"'0-INFOS GENERALES A REMPLIR'!B6","v":0}]
[]
[]
{"$rows_left_out":36}
{"sheet":"listes valeurs","index":7,"n_rows":1002,"n_cols":41,"rows_kept":1002,"cut":false,"hidden":false,"merged":[]}
["Num_réseau","Nom_réseau actuel","Nom_sous_réseau","Année_tirage_au_sort","Num_parcours","Longueur parcours","Code__Parcours","Liste réseaux","Conditions météo durant le parcours : ","dates oiseaux et pap.",null,"durée oiseaux","dates II papillons",null,"heures oiseaux","heures papillon","durée pap","date plantes",null,"Oiseaux code","Oiseaux espèce français","Oiseaux groupe","Oiseaux espèce latin","Papillons code","Papillons espèce français","Papillons groupe","Papillons espèce latin","Plante code","Plantes espèce français","Plantes groupe","Plantes espèce latin","Mammifère code","Mammifère espèce français","Mammifère groupe","Mammifère espèce latin","Reptiles code","Reptiles espèce français","Reptiles groupe","Reptiles espèce latin","Oui/Non","Validation interne"]
[84,"Arnon ","Arnon",2018,1,4297,"R084_P01","Arnon ","0 = détérioration ayant entraîné l’abandon du travail (relevé à refaire)",15,5,180,1,7,"05:00:00","10:00:00",180,1,7,"ACA   ","Accenteur alpin","Oiseaux","Prunella collaris                       ","DEM","Demi-deuil","Papillons","Melanargia galathea","KICKXIA","Linaire bâtarde","Plantes","Kickxia spuria","LIEVRE BRUN","Lièvre brun","Mammifères","Lepus europaeus","Lacerta agilis","Lézard agile","Reptiles","Lacerta agilis","oui","OK"]
[84,"Arnon ","Arnon",2018,2,3831,"R084_P02","Assens","1 = conditions médiocres",15,6,180,15,8,"11:00:00","17:00:00",240,15,8,"ACM   ","Accenteur mouchet","Oiseaux","Prunella modularis                      ","MYR","Myrtil","Papillons","Maniola jurtina","SILENE","Silène de nuit","Plantes","Silene noctiflora",null,null,null,null,null,null,null,null,"non","douteux/à vérifier"]
[84,"Arnon ","Arnon",2018,3,3486,"R084_P03","Aubonne-La Côte","2 = conditions moyennes",null,null,null,null,null,null,null,null,null,null,"AIG   ","Aigle royal","Oiseaux","Aquila chrysaetos                       ","NAC","Nacré de la sanguisorbe","Papillons","Brenthis ino"]
[84,"Arnon ","Arnon",2018,4,4651,"R084_P04","Augine","3 = conditions bonnes",null,null,null,null,null,null,null,null,null,null,"ALC","Alouette des champs","Oiseaux","Alauda arvensis                         ","SIL","Silène","Papillons","Brintesia circe"]
[111,"Assens","Assens",2019,1,3400,"R111_P01","Balcon du Léman",null,null,null,null,null,null,null,null,null,null,null,"ALL   ","Alouette lulu","Oiseaux","Lullula arborea                         ","TRI","Tristan","Papillons","Aphantopus hyperantus"]
[111,"Assens","Assens",2019,2,3400,"R111_P02","Ballaigues Lignerolle",null,null,null,null,null,null,null,null,null,null,null,"AUT   ","Autour des palombes","Oiseaux","Accipiter gentilis                      "]
[27,"Aubonne-La Côte","Aubonne-La Côte",2019,1,3883,"R027_P01","Basse-Menthue",null,null,null,null,null,null,null,null,null,null,null,"BAL   ","Balbuzard pêcheur","Oiseaux","Pandion haliaetus                       "]
{"$rows_left_out":995}
{"sheet":"contrôles","index":8,"n_rows":19,"n_cols":6,"rows_kept":19,"cut":false,"hidden":true,"merged":[]}
[null,"parcours","passage","Date","Heure","Durée du relevé"]
["Oiseaux",{"$f":"'2-OISEAUX'!C6","v":0},1,{"$f":"'2-OISEAUX'!E6","v":""},{"$f":"'2-OISEAUX'!E10","v":""},{"$f":"'2-OISEAUX'!C11","v":0}]
["Oiseaux",{"$f":"'2-OISEAUX'!F6","v":0},1,{"$f":"'2-OISEAUX'!H6","v":""},{"$f":"'2-OISEAUX'!H10","v":""},{"$f":"'2-OISEAUX'!F11","v":0}]
["Oiseaux",{"$f":"'2-OISEAUX'!I6","v":0},1,{"$f":"'2-OISEAUX'!K6","v":""},{"$f":"'2-OISEAUX'!K10","v":""},{"$f":"'2-OISEAUX'!I11","v":0}]
["Oiseaux",{"$f":"'2-OISEAUX'!M6","v":0},1,{"$f":"'2-OISEAUX'!N6","v":""},{"$f":"'2-OISEAUX'!N10","v":""},{"$f":"'2-OISEAUX'!M11","v":0}]
["Oiseaux",{"$f":"'2-OISEAUX'!P6","v":0},1,{"$f":"'2-OISEAUX'!Q6","v":""},{"$f":"'2-OISEAUX'!Q10","v":""},{"$f":"'2-OISEAUX'!P11","v":0}]
[null,"parcours","passage","Date","Heure","Durée du relevé"]
["PapillonI",{"$f":"'3-PAPILLONS'!C6","v":0},1,{"$f":"'3-PAPILLONS'!E10","v":""},{"$f":"'3-PAPILLONS'!E14","v":""},{"$f":"'3-PAPILLONS'!C15","v":0}]
{"$rows_left_out":12}
{"sheet":"test TCD","index":9,"n_rows":33,"n_cols":23,"rows_kept":33,"cut":false,"hidden":true,"merged":[]}
[]
["date","(Plusieurs éléments)",null,null,"date","(Plusieurs éléments)",null,null,"indicateur","Présence/absence",null,null,"indicateur","Nbre de sites différents **",null,null,"indicateur","Indice présence/absence"]
[null,null,null,null,"in/out","in",null,null,"in/out","in"]
["Moyenne de Valeur","Étiquettes de colonnes",null,null,null,null,null,null,null,null,null,null,"Somme de Valeur","Étiquettes de colonnes",null,null,"Moyenne de Valeur","Étiquettes de colonnes"]
["Étiquettes de lignes","Total général",null,null,"Moyenne de Valeur","Étiquettes de colonnes",null,null,"Moyenne de Valeur","Étiquettes de colonnes",null,null,"Étiquettes de lignes",2018,"Total général",null,"Étiquettes de lignes",2018,"Total général"]
["Total général",null,null,null,"Étiquettes de lignes","Total général",null,null,"Étiquettes de lignes",2018,"Total général",null,0,0,0,null,0,{"$error":"#DIV/0!"},{"$error":"#DIV/0!"}]
[null,null,null,null,"Total général",null,null,null,0,{"$error":"#DIV/0!"},{"$error":"#DIV/0!"},null,"Total général",0,0,null,"(vide)",{"$error":"#DIV/0!"},{"$error":"#DIV/0!"}]
[null,null,null,null,null,null,null,null,"(vide)",{"$error":"#DIV/0!"},{"$error":"#DIV/0!"},null,null,null,null,null,"Total général",{"$error":"#DIV/0!"},{"$error":"#DIV/0!"}]
{"$rows_left_out":26}
{"sheet":"listes commentaires","index":10,"n_rows":12,"n_cols":2,"rows_kept":12,"cut":false,"hidden":true,"merged":[]}
[]
["Lièvre","Nbre agriculteurs: il faut au moins 10 agriculteurs. Si nbre<10: merci de motiver sous remarques."]
["Lièvre","Il faut au moins 6 réponses valables: veuillez si possible compléter l'enquête auprès d'autres agriculteurs, sinon, motiver sous remarques."]
["Lièvre","Attention le nombre total de réponses doit correspondre au nombre d'agriculteurs. Merci de corriger."]
[]
["Oiseaux","Les relevés doivent être réalisés entre le 15.05. et le 15.06. Merci de justifier sous remarques."]
["Oiseaux","Les relevés doivent être réalisés entre 5h et 11h. Merci de justifier sous remarques."]
[]
{"$rows_left_out":5}
{"sheet":"compilation données pour export","index":11,"n_rows":256,"n_cols":29,"rows_kept":256,"cut":false,"hidden":true,"merged":[]}
["Année","réseau","ID réseau","parcours","Id parcours","Longueur parcours","parcelle","Id parcelle","Nombre de parcelles SPB favorables inscrites au réseau*: ","Nombre de parcelles SPB visitées: ","passage","date","heure début","heure fin","observateur","conditions","espèce français","Abréviation","nom latin","groupe","indicateur","Valeur","in/out","Validation interne"]
[{"$f":"'0-INFOS GENERALES A REMPLIR'!$B$4","v":2021},{"$f":"'0-INFOS GENERALES A REMPLIR'!$B$6","v":0},{"$f":"'0-INFOS GENERALES A REMPLIR'!$E$12","v":""},null,null,null,null,null,null,null,null,null,null,null,null,null,{"$f":"VLOOKUP('compilation données pour export'!$R2,'listes valeurs'!$AF$2:$AI$3450,2,FALSE)","v":"Lièvre brun"},{"$f":"'1-LIEVRE BRUN'!$A$2","v":"LIEVRE BRUN"},{"$f":"VLOOKUP('compilation données pour export'!$R2,'listes valeurs'!$AF$2:$AI$3450,4,FALSE)","v":"Lepus europaeus"},{"$f":"VLOOKUP('compilation données pour export'!$R2,'listes valeurs'!$AF$2:$AI$3450,3,FALSE)","v":"Mammifères"},"Nombre agriculteurs consultés",{"$f":"IF(ISBLANK('1-LIEVRE BRUN'!C12),0,'1-LIEVRE BRUN'!C12)","v":0},"in",{"$f":"'Synthese Annuelle Monitoring'!$Q$14","v":0}]
[{"$f":"'0-INFOS GENERALES A REMPLIR'!$B$4","v":2021},{"$f":"'0-INFOS GENERALES A REMPLIR'!$B$6","v":0},{"$f":"'0-INFOS GENERALES A REMPLIR'!$E$12","v":""},null,null,null,null,null,null,null,null,null,null,null,null,null,{"$f":"VLOOKUP('compilation données pour export'!$R3,'listes valeurs'!$AF$2:$AI$3450,2,FALSE)","v":"Lièvre brun"},{"$f":"'1-LIEVRE BRUN'!$A$2","v":"LIEVRE BRUN"},{"$f":"VLOOKUP('compilation données pour export'!$R3,'listes valeurs'!$AF$2:$AI$3450,4,FALSE)","v":"Lepus europaeus"},{"$f":"VLOOKUP('compilation données pour export'!$R3,'listes valeurs'!$AF$2:$AI$3450,3,FALSE)","v":"Mammifères"},"ne sait pas",{"$f":"IF(ISBLANK('1-LIEVRE BRUN'!C15),0,'1-LIEVRE BRUN'!C15)","v":0},"in",{"$f":"'Synthese Annuelle Monitoring'!$Q$14","v":0}]
[{"$f":"'0-INFOS GENERALES A REMPLIR'!$B$4","v":2021},{"$f":"'0-INFOS GENERALES A REMPLIR'!$B$6","v":0},{"$f":"'0-INFOS GENERALES A REMPLIR'!$E$12","v":""},null,null,null,null,null,null,null,null,null,null,null,null,null,{"$f":"VLOOKUP('compilation données pour export'!$R4,'listes valeurs'!$AF$2:$AI$3450,2,FALSE)","v":"Lièvre brun"},{"$f":"'1-LIEVRE BRUN'!$A$2","v":"LIEVRE BRUN"},{"$f":"VLOOKUP('compilation données pour export'!$R4,'listes valeurs'!$AF$2:$AI$3450,4,FALSE)","v":"Lepus europaeus"},{"$f":"VLOOKUP('compilation données pour export'!$R4,'listes valeurs'!$AF$2:$AI$3450,3,FALSE)","v":"Mammifères"}," 1 fois",{"$f":"IF(ISBLANK('1-LIEVRE BRUN'!C16),0,'1-LIEVRE BRUN'!C16)","v":0},"in",{"$f":"'Synthese Annuelle Monitoring'!$Q$14","v":0}]
[{"$f":"'0-INFOS GENERALES A REMPLIR'!$B$4","v":2021},{"$f":"'0-INFOS GENERALES A REMPLIR'!$B$6","v":0},{"$f":"'0-INFOS GENERALES A REMPLIR'!$E$12","v":""},null,null,null,null,null,null,null,null,null,null,null,null,null,{"$f":"VLOOKUP('compilation données pour export'!$R5,'listes valeurs'!$AF$2:$AI$3450,2,FALSE)","v":"Lièvre brun"},{"$f":"'1-LIEVRE BRUN'!$A$2","v":"LIEVRE BRUN"},{"$f":"VLOOKUP('compilation données pour export'!$R5,'listes valeurs'!$AF$2:$AI$3450,4,FALSE)","v":"Lepus europaeus"},{"$f":"VLOOKUP('compilation données pour export'!$R5,'listes valeurs'!$AF$2:$AI$3450,3,FALSE)","v":"Mammifères"},"2-5 fois",{"$f":"IF(ISBLANK('1-LIEVRE BRUN'!C17),0,'1-LIEVRE BRUN'!C17)","v":0},"in",{"$f":"'Synthese Annuelle Monitoring'!$Q$14","v":0}]
[{"$f":"'0-INFOS GENERALES A REMPLIR'!$B$4","v":2021},{"$f":"'0-INFOS GENERALES A REMPLIR'!$B$6","v":0},{"$f":"'0-INFOS GENERALES A REMPLIR'!$E$12","v":""},null,null,null,null,null,null,null,null,null,null,null,null,null,{"$f":"VLOOKUP('compilation données pour export'!$R6,'listes valeurs'!$AF$2:$AI$3450,2,FALSE)","v":"Lièvre brun"},{"$f":"'1-LIEVRE BRUN'!$A$2","v":"LIEVRE BRUN"},{"$f":"VLOOKUP('compilation données pour export'!$R6,'listes valeurs'!$AF$2:$AI$3450,4,FALSE)","v":"Lepus europaeus"},{"$f":"VLOOKUP('compilation données pour export'!$R6,'listes valeurs'!$AF$2:$AI$3450,3,FALSE)","v":"Mammifères"},"> 5 fois",{"$f":"IF(ISBLANK('1-LIEVRE BRUN'!C18),0,'1-LIEVRE BRUN'!C18)","v":0},"in",{"$f":"'Synthese Annuelle Monitoring'!$Q$14","v":0}]
[{"$f":"'0-INFOS GENERALES A REMPLIR'!$B$4","v":2021},{"$f":"'0-INFOS GENERALES A REMPLIR'!$B$6","v":0},{"$f":"'0-INFOS GENERALES A REMPLIR'!$E$12","v":""},null,null,null,null,null,null,null,null,null,null,null,null,null,{"$f":"VLOOKUP('compilation données pour export'!$R7,'listes valeurs'!$AF$2:$AI$3450,2,FALSE)","v":"Lièvre brun"},{"$f":"'1-LIEVRE BRUN'!$A$2","v":"LIEVRE BRUN"},{"$f":"VLOOKUP('compilation données pour export'!$R7,'listes valeurs'!$AF$2:$AI$3450,4,FALSE)","v":"Lepus europaeus"},{"$f":"VLOOKUP('compilation données pour export'!$R7,'listes valeurs'!$AF$2:$AI$3450,3,FALSE)","v":"Mammifères"},"non",{"$f":"IF(ISBLANK('1-LIEVRE BRUN'!C19),0,'1-LIEVRE BRUN'!C19)","v":0},"in",{"$f":"'Synthese Annuelle Monitoring'!$Q$14","v":0}]
[{"$f":"'0-INFOS GENERALES A REMPLIR'!$B$4","v":2021},{"$f":"'0-INFOS GENERALES A REMPLIR'!$B$6","v":0},{"$f":"'0-INFOS GENERALES A REMPLIR'!$E$12","v":""},null,null,null,null,null,null,null,null,null,null,null,null,null,{"$f":"VLOOKUP('compilation données pour export'!$R8,'listes valeurs'!$AF$2:$AI$3450,2,FALSE)","v":"Lièvre brun"},{"$f":"'1-LIEVRE BRUN'!$A$2","v":"LIEVRE BRUN"},{"$f":"VLOOKUP('compilation données pour export'!$R8,'listes valeurs'!$AF$2:$AI$3450,4,FALSE)","v":"Lepus europaeus"},{"$f":"VLOOKUP('compilation données pour export'!$R8,'listes valeurs'!$AF$2:$AI$3450,3,FALSE)","v":"Mammifères"},"Indice présence/absence",{"$f":"IF(OR(V2=\"\",V2=0),\"\",SUM(V4:V6)/SUM(V4:V7))","v":""},"in",{"$f":"'Synthese Annuelle Monitoring'!$Q$14","v":0}]
{"$rows_left_out":248}